{"text_format":"1","workbook":"xlsx","n_sheets":8,"sheets":["wyniki","ile_zawodniow","liga","tabela_liga","zgloszenie","karta_kapitana","3_27","4_36"],"not_rendered":{"charts":0,"images":2,"macros":0,"external_links":0,"defined_names":6,"comments":0,"pivot_tables":0},"unopened":[],"bounds":{"document_bytes":16777216,"sheet_cells":100000,"rows_first":2000,"rows_last":500,"rows_between":2000,"halvings":0,"cell_chars":16384,"cell_head_chars":4096},"cells_cut":0,"cells_raw":0,"read":"whole","date_system":"1900"}

{"sheet":"wyniki","index":0,"n_rows":45,"n_cols":17,"rows_kept":45,"cut":false,"hidden":false,"merged":[[0,0,0,5],[0,6,0,8],[0,9,0,16],[1,0,1,2],[1,3,1,5],[1,6,1,8],[1,9,1,16],[2,0,2,2],[2,3,2,5],[2,6,2,8],[2,9,2,16],[3,0,3,4],[3,5,3,7],[3,8,3,10],[3,11,3,13],[3,14,3,16]]}
["VI Grand Prix Północy 2024",null,null,null,null,null,"Miejsce i data:",null,null,"Dziemiany, 28.9.2024"]
["Zawody przeprowadził klub:",null,null,"S.K. FAMILY Dziemiany",null,null,"Kierownictwo:",null,null,"Marcin Żywicki"]
["Sędzia:",null,null,"Szatkowski Leszek",null,null,"Sekretariat:",null,null,"Marcin Żywicki"]
["Klasyfikacja zawodów",null,null,null,null,"S U M A",null,null,"I SERIA",null,null,"II SERIA",null,null,"II SERIA"]
["M-ce","nr start.","Nazwisko, Imię","Klub","Opłata","Z gry","w","p","Z gry1","w1","p1","Z gry2","w2","p2","Z gry3","w3","p3"]
["1.",10,"Siemaszko Henryk","Krajna Złotów",null,{"$f":"IF(Indywidualna[[#This Row],[Opłata]]=\"L\",0,I6+L6+O6)","v":3434},{"$f":"IF(Indywidualna[[#This Row],[Opłata]]=10,0,J6+M6+P6)","v":33},{"$f":"IF(Indywidualna[[#This Row],[Opłata]]=10,0,K6+N6+Q6)","v":1},1229,13,1,1138,11,0,1067,9,0]
["2.",null,"Kozikowski Jan","nz",null,{"$f":"IF(Indywidualna[[#This Row],[Opłata]]=\"L\",0,I7+L7+O7)","v":2769},{"$f":"IF(Indywidualna[[#This Row],[Opłata]]=10,0,J7+M7+P7)","v":24},{"$f":"IF(Indywidualna[[#This Row],[Opłata]]=10,0,K7+N7+Q7)","v":3},866,6,0,1051,10,1,852,8,2]
["3.",null,"Tadeusz Maciej","Krajna Złotów",null,{"$f":"IF(Indywidualna[[#This Row],[Opłata]]=\"L\",0,I8+L8+O8)","v":2728},{"$f":"IF(Indywidualna[[#This Row],[Opłata]]=10,0,J8+M8+P8)","v":27},{"$f":"IF(Indywidualna[[#This Row],[Opłata]]=10,0,K8+N8+Q8)","v":5},863,8,0,919,9,3,946,10,2]
["4.",3,"Moch Ireneusz","Fala Świekatowo",null,{"$f":"IF(Indywidualna[[#This Row],[Opłata]]=\"L\",0,I9+L9+O9)","v":2551},{"$f":"IF(Indywidualna[[#This Row],[Opłata]]=10,0,J9+M9+P9)","v":25},{"$f":"IF(Indywidualna[[#This Row],[Opłata]]=10,0,K9+N9+Q9)","v":1},1102,10,0,1069,10,0,380,5,1]
["5.",11,"Szatkowski Leszek","Krajna Złotów",null,{"$f":"IF(Indywidualna[[#This Row],[Opłata]]=\"L\",0,I10+L10+O10)","v":2514},{"$f":"IF(Indywidualna[[#This Row],[Opłata]]=10,0,J10+M10+P10)","v":29},{"$f":"IF(Indywidualna[[#This Row],[Opłata]]=10,0,K10+N10+Q10)","v":8},1279,13,1,60,5,5,1175,11,2]
["6.",null,"Kubiszewski Bartosz","S.K. FAMILY Dziemiany",null,{"$f":"IF(Indywidualna[[#This Row],[Opłata]]=\"L\",0,I11+L11+O11)","v":2505},{"$f":"IF(Indywidualna[[#This Row],[Opłata]]=10,0,J11+M11+P11)","v":22},{"$f":"IF(Indywidualna[[#This Row],[Opłata]]=10,0,K11+N11+Q11)","v":2},1039,10,0,444,5,2,1022,7,0]
["7.",15,"Piasecki Jan","Krajna Złotów",null,{"$f":"IF(Indywidualna[[#This Row],[Opłata]]=\"L\",0,I12+L12+O12)","v":2438},{"$f":"IF(Indywidualna[[#This Row],[Opłata]]=10,0,J12+M12+P12)","v":26},{"$f":"IF(Indywidualna[[#This Row],[Opłata]]=10,0,K12+N12+Q12)","v":5},848,8,1,626,7,2,964,11,2]
["8.",null,"Kozikowski Bogusław","nz",null,{"$f":"IF(Indywidualna[[#This Row],[Opłata]]=\"L\",0,I13+L13+O13)","v":2433},{"$f":"IF(Indywidualna[[#This Row],[Opłata]]=10,0,J13+M13+P13)","v":19},{"$f":"IF(Indywidualna[[#This Row],[Opłata]]=10,0,K13+N13+Q13)","v":1},894,8,0,527,5,1,1012,6,0]
["9.",27,"Mikołajczyk Tomasz","S.K. FAMILY Dziemiany",null,{"$f":"IF(Indywidualna[[#This Row],[Opłata]]=\"L\",0,I14+L14+O14)","v":2326},{"$f":"IF(Indywidualna[[#This Row],[Opłata]]=10,0,J14+M14+P14)","v":25},{"$f":"IF(Indywidualna[[#This Row],[Opłata]]=10,0,K14+N14+Q14)","v":5},1322,11,0,395,5,1,609,9,4]
["10.",26,"Mikołajczyk Rafał","S.K. FAMILY Dziemiany",null,{"$f":"IF(Indywidualna[[#This Row],[Opłata]]=\"L\",0,I15+L15+O15)","v":2293},{"$f":"IF(Indywidualna[[#This Row],[Opłata]]=10,0,J15+M15+P15)","v":28},{"$f":"IF(Indywidualna[[#This Row],[Opłata]]=10,0,K15+N15+Q15)","v":5},590,7,1,995,10,1,708,11,3]
["11.",2,"Glama Stanisław","Fala Świekatowo",null,{"$f":"IF(Indywidualna[[#This Row],[Opłata]]=\"L\",0,I16+L16+O16)","v":2288},{"$f":"IF(Indywidualna[[#This Row],[Opłata]]=10,0,J16+M16+P16)","v":26},{"$f":"IF(Indywidualna[[#This Row],[Opłata]]=10,0,K16+N16+Q16)","v":5},890,7,0,941,12,2,457,7,3]
["12.",null,"Przybyłka Elżbieta","Krajna Złotów",null,{"$f":"IF(Indywidualna[[#This Row],[Opłata]]=\"L\",0,I17+L17+O17)","v":2272},{"$f":"IF(Indywidualna[[#This Row],[Opłata]]=10,0,J17+M17+P17)","v":20},{"$f":"IF(Indywidualna[[#This Row],[Opłata]]=10,0,K17+N17+Q17)","v":2},472,5,1,842,7,1,958,8,0]
["13.",null,"Jędrzejczak Jerzy","GOKSiR Liniewo",null,{"$f":"IF(Indywidualna[[#This Row],[Opłata]]=\"L\",0,I18+L18+O18)","v":2236},{"$f":"IF(Indywidualna[[#This Row],[Opłata]]=10,0,J18+M18+P18)","v":28},{"$f":"IF(Indywidualna[[#This Row],[Opłata]]=10,0,K18+N18+Q18)","v":7},719,9,1,934,9,3,583,10,3]
["14.",4,"Szatkowski Mirosław","Fala Świekatowo",null,{"$f":"IF(Indywidualna[[#This Row],[Opłata]]=\"L\",0,I19+L19+O19)","v":2120},{"$f":"IF(Indywidualna[[#This Row],[Opłata]]=10,0,J19+M19+P19)","v":29},{"$f":"IF(Indywidualna[[#This Row],[Opłata]]=10,0,K19+N19+Q19)","v":8},890,9,1,530,10,4,700,10,3]
["15.",5,"Narloch Stanisław","GOKSiR Liniewo",null,{"$f":"IF(Indywidualna[[#This Row],[Opłata]]=\"L\",0,I20+L20+O20)","v":2104},{"$f":"IF(Indywidualna[[#This Row],[Opłata]]=10,0,J20+M20+P20)","v":24},{"$f":"IF(Indywidualna[[#This Row],[Opłata]]=10,0,K20+N20+Q20)","v":6},558,6,1,1510,14,0,36,4,5]
["16.",1,"Szneidrowski Marek","Fala Świekatowo",null,{"$f":"IF(Indywidualna[[#This Row],[Opłata]]=\"L\",0,I21+L21+O21)","v":2104},{"$f":"IF(Indywidualna[[#This Row],[Opłata]]=10,0,J21+M21+P21)","v":17},{"$f":"IF(Indywidualna[[#This Row],[Opłata]]=10,0,K21+N21+Q21)","v":0},449,3,0,857,7,0,798,7,0]
["17.",null,"Felski Kazimierz","nz",null,{"$f":"IF(Indywidualna[[#This Row],[Opłata]]=\"L\",0,I22+L22+O22)","v":2068},{"$f":"IF(Indywidualna[[#This Row],[Opłata]]=10,0,J22+M22+P22)","v":19},{"$f":"IF(Indywidualna[[#This Row],[Opłata]]=10,0,K22+N22+Q22)","v":3},534,4,1,711,6,0,823,9,2]
["18.",21,"Pawlicki Andrzej","MOKSiR Puck",null,{"$f":"IF(Indywidualna[[#This Row],[Opłata]]=\"L\",0,I23+L23+O23)","v":2039},{"$f":"IF(Indywidualna[[#This Row],[Opłata]]=10,0,J23+M23+P23)","v":22},{"$f":"IF(Indywidualna[[#This Row],[Opłata]]=10,0,K23+N23+Q23)","v":4},759,7,0,698,8,2,582,7,2]
["19.",18,"Baran Adam","MOKSiR Puck",null,{"$f":"IF(Indywidualna[[#This Row],[Opłata]]=\"L\",0,I24+L24+O24)","v":2005},{"$f":"IF(Indywidualna[[#This Row],[Opłata]]=10,0,J24+M24+P24)","v":27},{"$f":"IF(Indywidualna[[#This Row],[Opłata]]=10,0,K24+N24+Q24)","v":8},624,6,1,1121,11,1,260,10,6]
["20.",9,"Biniakiewicz Marian","Krajna Złotów",null,{"$f":"IF(Indywidualna[[#This Row],[Opłata]]=\"L\",0,I25+L25+O25)","v":1997},{"$f":"IF(Indywidualna[[#This Row],[Opłata]]=10,0,J25+M25+P25)","v":23},{"$f":"IF(Indywidualna[[#This Row],[Opłata]]=10,0,K25+N25+Q25)","v":7},344,6,3,1436,14,1,217,3,3]
["21.",null,"Kujaszewski Kazimierz","S.K. FAMILY Dziemiany",null,{"$f":"IF(Indywidualna[[#This Row],[Opłata]]=\"L\",0,I26+L26+O26)","v":1941},{"$f":"IF(Indywidualna[[#This Row],[Opłata]]=10,0,J26+M26+P26)","v":25},{"$f":"IF(Indywidualna[[#This Row],[Opłata]]=10,0,K26+N26+Q26)","v":8},774,12,4,363,7,4,804,6,0]
["22.",24,"Muża Jan","MOKSiR Puck",null,{"$f":"IF(Indywidualna[[#This Row],[Opłata]]=\"L\",0,I27+L27+O27)","v":1933},{"$f":"IF(Indywidualna[[#This Row],[Opłata]]=10,0,J27+M27+P27)","v":17},{"$f":"IF(Indywidualna[[#This Row],[Opłata]]=10,0,K27+N27+Q27)","v":4},904,8,1,553,4,1,476,5,2]
["23.",25,"Mikołajczyk Paweł","S.K. FAMILY Dziemiany",null,{"$f":"IF(Indywidualna[[#This Row],[Opłata]]=\"L\",0,I28+L28+O28)","v":1921},{"$f":"IF(Indywidualna[[#This Row],[Opłata]]=10,0,J28+M28+P28)","v":22},{"$f":"IF(Indywidualna[[#This Row],[Opłata]]=10,0,K28+N28+Q28)","v":8},563,7,2,730,7,3,628,8,3]
["24.",8,"Wróbel Teresa","GOKSiR Liniewo",null,{"$f":"IF(Indywidualna[[#This Row],[Opłata]]=\"L\",0,I29+L29+O29)","v":1913},{"$f":"IF(Indywidualna[[#This Row],[Opłata]]=10,0,J29+M29+P29)","v":19},{"$f":"IF(Indywidualna[[#This Row],[Opłata]]=10,0,K29+N29+Q29)","v":5},759,7,1,720,8,3,434,4,1]
["25.",17,"Bekisz Zdzisław","MOKSiR Puck",null,{"$f":"IF(Indywidualna[[#This Row],[Opłata]]=\"L\",0,I30+L30+O30)","v":1903},{"$f":"IF(Indywidualna[[#This Row],[Opłata]]=10,0,J30+M30+P30)","v":18},{"$f":"IF(Indywidualna[[#This Row],[Opłata]]=10,0,K30+N30+Q30)","v":4},1102,10,1,-24,3,3,825,5,0]
["26.",19,"Mikołajczyk Szymon","S.K. FAMILY Dziemiany",null,{"$f":"IF(Indywidualna[[#This Row],[Opłata]]=\"L\",0,I31+L31+O31)","v":1810},{"$f":"IF(Indywidualna[[#This Row],[Opłata]]=10,0,J31+M31+P31)","v":19},{"$f":"IF(Indywidualna[[#This Row],[Opłata]]=10,0,K31+N31+Q31)","v":5},301,4,2,862,9,1,647,6,2]
["27.",null,"Bekisz Kazimierz","nz",null,{"$f":"IF(Indywidualna[[#This Row],[Opłata]]=\"L\",0,I32+L32+O32)","v":1792},{"$f":"IF(Indywidualna[[#This Row],[Opłata]]=10,0,J32+M32+P32)","v":20},{"$f":"IF(Indywidualna[[#This Row],[Opłata]]=10,0,K32+N32+Q32)","v":7},933,7,1,242,5,4,617,8,2]
["28.",14,"Bełka Jan","Krajna Złotów",null,{"$f":"IF(Indywidualna[[#This Row],[Opłata]]=\"L\",0,I33+L33+O33)","v":1761},{"$f":"IF(Indywidualna[[#This Row],[Opłata]]=10,0,J33+M33+P33)","v":22},{"$f":"IF(Indywidualna[[#This Row],[Opłata]]=10,0,K33+N33+Q33)","v":8},1130,12,2,254,7,4,377,3,2]
["29.",22,"Radtke Marek","MOKSiR Puck",null,{"$f":"IF(Indywidualna[[#This Row],[Opłata]]=\"L\",0,I34+L34+O34)","v":1684},{"$f":"IF(Indywidualna[[#This Row],[Opłata]]=10,0,J34+M34+P34)","v":21},{"$f":"IF(Indywidualna[[#This Row],[Opłata]]=10,0,K34+N34+Q34)","v":8},400,6,2,492,6,3,792,9,3]
["30.",null,"Faruga Jan","TS Pszczyna",null,{"$f":"IF(Indywidualna[[#This Row],[Opłata]]=\"L\",0,I35+L35+O35)","v":1508},{"$f":"IF(Indywidualna[[#This Row],[Opłata]]=10,0,J35+M35+P35)","v":10},{"$f":"IF(Indywidualna[[#This Row],[Opłata]]=10,0,K35+N35+Q35)","v":3},412,3,2,422,2,0,674,5,1]
["31.",7,"Wirkus Józef","GOKSiR Liniewo",null,{"$f":"IF(Indywidualna[[#This Row],[Opłata]]=\"L\",0,I36+L36+O36)","v":1494},{"$f":"IF(Indywidualna[[#This Row],[Opłata]]=10,0,J36+M36+P36)","v":16},{"$f":"IF(Indywidualna[[#This Row],[Opłata]]=10,0,K36+N36+Q36)","v":4},353,6,2,293,3,2,848,7,0]
["32.",null,"Warnke Tadeusz","nz",null,{"$f":"IF(Indywidualna[[#This Row],[Opłata]]=\"L\",0,I37+L37+O37)","v":1461},{"$f":"IF(Indywidualna[[#This Row],[Opłata]]=10,0,J37+M37+P37)","v":15},{"$f":"IF(Indywidualna[[#This Row],[Opłata]]=10,0,K37+N37+Q37)","v":4},548,6,2,296,5,2,617,4,0]
["33.",6,"Gostomski Zenon","GOKSiR Liniewo",null,{"$f":"IF(Indywidualna[[#This Row],[Opłata]]=\"L\",0,I38+L38+O38)","v":1412},{"$f":"IF(Indywidualna[[#This Row],[Opłata]]=10,0,J38+M38+P38)","v":10},{"$f":"IF(Indywidualna[[#This Row],[Opłata]]=10,0,K38+N38+Q38)","v":1},540,6,1,392,1,0,480,3,0]
["34.",28,"Kujawski Łukasz","S.K. FAMILY Dziemiany",null,{"$f":"IF(Indywidualna[[#This Row],[Opłata]]=\"L\",0,I39+L39+O39)","v":1349},{"$f":"IF(Indywidualna[[#This Row],[Opłata]]=10,0,J39+M39+P39)","v":19},{"$f":"IF(Indywidualna[[#This Row],[Opłata]]=10,0,K39+N39+Q39)","v":7},70,4,4,644,7,0,635,8,3]
["35.",13,"Kowalski Konrad","Krajna Złotów",null,{"$f":"IF(Indywidualna[[#This Row],[Opłata]]=\"L\",0,I40+L40+O40)","v":1318},{"$f":"IF(Indywidualna[[#This Row],[Opłata]]=10,0,J40+M40+P40)","v":22},{"$f":"IF(Indywidualna[[#This Row],[Opłata]]=10,0,K40+N40+Q40)","v":9},774,9,1,164,6,4,380,7,4]
["36.",20,"Mikołajczyk Nadia","S.K. FAMILY Dziemiany",null,{"$f":"IF(Indywidualna[[#This Row],[Opłata]]=\"L\",0,I41+L41+O41)","v":1292},{"$f":"IF(Indywidualna[[#This Row],[Opłata]]=10,0,J41+M41+P41)","v":14},{"$f":"IF(Indywidualna[[#This Row],[Opłata]]=10,0,K41+N41+Q41)","v":4},215,4,3,384,4,1,693,6,0]
["37.",null,"Borzyszkowski Ryszard","S.K. FAMILY Dziemiany",null,{"$f":"IF(Indywidualna[[#This Row],[Opłata]]=\"L\",0,I42+L42+O42)","v":1257},{"$f":"IF(Indywidualna[[#This Row],[Opłata]]=10,0,J42+M42+P42)","v":14},{"$f":"IF(Indywidualna[[#This Row],[Opłata]]=10,0,K42+N42+Q42)","v":4},360,5,1,428,4,2,469,5,1]
["38.",23,"Szczypior Stefan","MOKSiR Puck",null,{"$f":"IF(Indywidualna[[#This Row],[Opłata]]=\"L\",0,I43+L43+O43)","v":1197},{"$f":"IF(Indywidualna[[#This Row],[Opłata]]=10,0,J43+M43+P43)","v":13},{"$f":"IF(Indywidualna[[#This Row],[Opłata]]=10,0,K43+N43+Q43)","v":4},22,2,2,539,6,1,636,5,1]
["39.",12,"Bianga Edward","Krajna Złotów",null,{"$f":"IF(Indywidualna[[#This Row],[Opłata]]=\"L\",0,I44+L44+O44)","v":1117},{"$f":"IF(Indywidualna[[#This Row],[Opłata]]=10,0,J44+M44+P44)","v":16},{"$f":"IF(Indywidualna[[#This Row],[Opłata]]=10,0,K44+N44+Q44)","v":5},587,7,1,771,7,0,-241,2,4]
["40.",16,"Kazimierowski Stanisław","Krajna Złotów",null,{"$f":"IF(Indywidualna[[#This Row],[Opłata]]=\"L\",0,I45+L45+O45)","v":1026},{"$f":"IF(Indywidualna[[#This Row],[Opłata]]=10,0,J45+M45+P45)","v":15},{"$f":"IF(Indywidualna[[#This Row],[Opłata]]=10,0,K45+N45+Q45)","v":7},91,5,5,535,5,1,400,5,1]

{"sheet":"ile_zawodniow","index":1,"n_rows":9,"n_cols":2,"rows_kept":9,"cut":false,"hidden":false,"merged":[]}
["ZAWODNIKÓW:",{"$f":"SUM(B3:B9)","v":0}]
["STOŁÓW:",{"$f":"ROUNDUP(B1/4,0)","v":0}]
["MOKSiR Puck",{"$f":"COUNTIFS(Indywidualna[Opłata],\">0\",Indywidualna[Klub],A3)","v":0}]
["GOKSiR Lipusz",{"$f":"COUNTIFS(Indywidualna[Opłata],\">0\",Indywidualna[Klub],A4)","v":0}]
["GOKSiR Liniewo",{"$f":"COUNTIFS(Indywidualna[Opłata],\">0\",Indywidualna[Klub],A5)","v":0}]
["S.K. FAMILY Dziemiany",{"$f":"COUNTIFS(Indywidualna[Opłata],\">0\",Indywidualna[Klub],A6)","v":0}]
["KS KRAJNA Złotów",{"$f":"COUNTIFS(Indywidualna[Opłata],\">0\",Indywidualna[Klub],A7)","v":0}]
["FALA Świekatowo",{"$f":"COUNTIFS(Indywidualna[Opłata],\">0\",Indywidualna[Klub],A8)","v":0}]
["niezrzeszony",{"$f":"COUNTIFS(Indywidualna[Opłata],\">0\",Indywidualna[Klub],A9)","v":0}]

{"sheet":"liga","index":2,"n_rows":111,"n_cols":14,"rows_kept":111,"cut":false,"hidden":false,"merged":[[0,0,0,13],[1,0,1,1],[1,2,1,7],[1,9,1,13],[2,0,2,1],[2,2,2,7],[2,9,2,13],[3,0,3,13],[4,0,4,1],[4,2,4,4],[4,5,4,7],[4,8,4,10],[4,11,4,13],[5,0,5,1],[11,0,11,1],[12,0,12,13],[13,0,13,1],[13,2,13,4],[13,5,13,7],[13,8,13,10],[13,11,13,13],[14,0,14,1],[20,0,20,1],[21,0,21,13],[22,0,22,1],[22,2,22,4],[22,5,22,7],[22,8,22,10],[22,11,22,13],[23,0,23,1],[29,0,29,1],[30,0,30,13],[31,0,31,1],[31,2,31,4],[31,5,31,7],[31,8,31,10],[31,11,31,13],[32,0,32,1],[38,0,38,1],[39,0,39,13],[40,0,40,1],[40,2,40,4],[40,5,40,7],[40,8,40,10],[40,11,40,13],[41,0,41,1],[47,0,47,1],[48,0,48,13],[49,0,49,1],[49,2,49,4],[49,5,49,7],[49,8,49,10],[49,11,49,13],[50,0,50,1],[56,0,56,1],[57,0,57,13],[58,0,58,1],[58,2,58,4],[58,5,58,7],[58,8,58,10],[58,11,58,13],[59,0,59,1],[65,0,65,1],[66,0,66,13],[67,0,67,1],[67,2,67,4],[67,5,67,7],[67,8,67,10],[67,11,67,13],[68,0,68,1],[74,0,74,1],[75,0,75,13],[76,0,76,1],[76,2,76,4],[76,5,76,7],[76,8,76,10],[76,11,76,13],[77,0,77,1],[83,0,83,1],[84,0,84,13],[85,0,85,1],[85,2,85,4],[85,5,85,7],[85,8,85,10],[85,11,85,13],[86,0,86,1],[92,0,92,1],[93,0,93,13],[94,0,94,1],[94,2,94,4],[94,5,94,7],[94,8,94,10],[94,11,94,13],[95,0,95,1],[101,0,101,1],[102,0,102,13],[103,0,103,1],[103,2,103,4],[103,5,103,7],[103,8,103,10],[103,11,103,13],[104,0,104,1],[110,0,110,1],[111,0,112,13]]}
["Liga Okręgu Pólnoc"]
["Gospodarz zawodów:",null,"GOKSiR Liniewo",null,null,null,null,null,"Data","Liniewo, 16.6.2024"]
["Kierownik zawodów:",null,"Narloch Stanisław",null,null,null,null,null,"Sędzia:"]
[]
["Drużyna",null,"RAZEM",null,null,"I SERIA",null,null,"II SERIA",null,null,"III SERIA"]
["MOKSiR Puck",null,"m.p","w","p","m.p","w","p","m.p","w","p","m.p","w","p"]
[17,{"$f":"_xlfn.IFNA(VLOOKUP(A7,Indywidualna[],2,0),0)","v":"Bekisz Zdzisław"},{"$f":"I7+L7+F7","v":1903},{"$f":"J7+M7+G7","v":18},{"$f":"K7+N7+H7","v":4},{"$f":"_xlfn.IFNA(VLOOKUP($A7,Indywidualna[],COLUMNS($F6:F6)+7,0),0)","v":1102},{"$f":"_xlfn.IFNA(VLOOKUP($A7,Indywidualna[],COLUMNS($F6:G6)+7,0),0)","v":10},{"$f":"_xlfn.IFNA(VLOOKUP($A7,Indywidualna[],COLUMNS($F6:H6)+7,0),0)","v":1},{"$f":"_xlfn.IFNA(VLOOKUP($A7,Indywidualna[],COLUMNS($F6:I6)+7,0),0)","v":-24},{"$f":"_xlfn.IFNA(VLOOKUP($A7,Indywidualna[],COLUMNS($F6:J6)+7,0),0)","v":3},{"$f":"_xlfn.IFNA(VLOOKUP($A7,Indywidualna[],COLUMNS($F6:K6)+7,0),0)","v":3},{"$f":"_xlfn.IFNA(VLOOKUP($A7,Indywidualna[],COLUMNS($F6:L6)+7,0),0)","v":825},{"$f":"_xlfn.IFNA(VLOOKUP($A7,Indywidualna[],COLUMNS($F6:M6)+7,0),0)","v":5},{"$f":"_xlfn.IFNA(VLOOKUP($A7,Indywidualna[],COLUMNS($F6:N6)+7,0),0)","v":0}]
[18,{"$f":"_xlfn.IFNA(VLOOKUP(A8,Indywidualna[],2,0),0)","v":"Baran Adam"},{"$f":"I8+L8+F8","v":2005},{"$f":"J8+M8+G8","v":27},{"$f":"K8+N8+H8","v":8},{"$f":"_xlfn.IFNA(VLOOKUP($A8,Indywidualna[],COLUMNS($F7:F7)+7,0),0)","v":624},{"$f":"_xlfn.IFNA(VLOOKUP($A8,Indywidualna[],COLUMNS($F7:G7)+7,0),0)","v":6},{"$f":"_xlfn.IFNA(VLOOKUP($A8,Indywidualna[],COLUMNS($F7:H7)+7,0),0)","v":1},{"$f":"_xlfn.IFNA(VLOOKUP($A8,Indywidualna[],COLUMNS($F7:I7)+7,0),0)","v":1121},{"$f":"_xlfn.IFNA(VLOOKUP($A8,Indywidualna[],COLUMNS($F7:J7)+7,0),0)","v":11},{"$f":"_xlfn.IFNA(VLOOKUP($A8,Indywidualna[],COLUMNS($F7:K7)+7,0),0)","v":1},{"$f":"_xlfn.IFNA(VLOOKUP($A8,Indywidualna[],COLUMNS($F7:L7)+7,0),0)","v":260},{"$f":"_xlfn.IFNA(VLOOKUP($A8,Indywidualna[],COLUMNS($F7:M7)+7,0),0)","v":10},{"$f":"_xlfn.IFNA(VLOOKUP($A8,Indywidualna[],COLUMNS($F7:N7)+7,0),0)","v":6}]
[19,{"$f":"_xlfn.IFNA(VLOOKUP(A9,Indywidualna[],2,0),0)","v":"Mikołajczyk Szymon"},{"$f":"I9+L9+F9","v":1810},{"$f":"J9+M9+G9","v":19},{"$f":"K9+N9+H9","v":5},{"$f":"_xlfn.IFNA(VLOOKUP($A9,Indywidualna[],COLUMNS($F8:F8)+7,0),0)","v":301},{"$f":"_xlfn.IFNA(VLOOKUP($A9,Indywidualna[],COLUMNS($F8:G8)+7,0),0)","v":4},{"$f":"_xlfn.IFNA(VLOOKUP($A9,Indywidualna[],COLUMNS($F8:H8)+7,0),0)","v":2},{"$f":"_xlfn.IFNA(VLOOKUP($A9,Indywidualna[],COLUMNS($F8:I8)+7,0),0)","v":862},{"$f":"_xlfn.IFNA(VLOOKUP($A9,Indywidualna[],COLUMNS($F8:J8)+7,0),0)","v":9},{"$f":"_xlfn.IFNA(VLOOKUP($A9,Indywidualna[],COLUMNS($F8:K8)+7,0),0)","v":1},{"$f":"_xlfn.IFNA(VLOOKUP($A9,Indywidualna[],COLUMNS($F8:L8)+7,0),0)","v":647},{"$f":"_xlfn.IFNA(VLOOKUP($A9,Indywidualna[],COLUMNS($F8:M8)+7,0),0)","v":6},{"$f":"_xlfn.IFNA(VLOOKUP($A9,Indywidualna[],COLUMNS($F8:N8)+7,0),0)","v":2}]
[20,{"$f":"_xlfn.IFNA(VLOOKUP(A10,Indywidualna[],2,0),0)","v":"Mikołajczyk Nadia"},{"$f":"I10+L10+F10","v":1292},{"$f":"J10+M10+G10","v":14},{"$f":"K10+N10+H10","v":4},{"$f":"_xlfn.IFNA(VLOOKUP($A10,Indywidualna[],COLUMNS($F9:F9)+7,0),0)","v":215},{"$f":"_xlfn.IFNA(VLOOKUP($A10,Indywidualna[],COLUMNS($F9:G9)+7,0),0)","v":4},{"$f":"_xlfn.IFNA(VLOOKUP($A10,Indywidualna[],COLUMNS($F9:H9)+7,0),0)","v":3},{"$f":"_xlfn.IFNA(VLOOKUP($A10,Indywidualna[],COLUMNS($F9:I9)+7,0),0)","v":384},{"$f":"_xlfn.IFNA(VLOOKUP($A10,Indywidualna[],COLUMNS($F9:J9)+7,0),0)","v":4},{"$f":"_xlfn.IFNA(VLOOKUP($A10,Indywidualna[],COLUMNS($F9:K9)+7,0),0)","v":1},{"$f":"_xlfn.IFNA(VLOOKUP($A10,Indywidualna[],COLUMNS($F9:L9)+7,0),0)","v":693},{"$f":"_xlfn.IFNA(VLOOKUP($A10,Indywidualna[],COLUMNS($F9:M9)+7,0),0)","v":6},{"$f":"_xlfn.IFNA(VLOOKUP($A10,Indywidualna[],COLUMNS($F9:N9)+7,0),0)","v":0}]
[null,{"$f":"_xlfn.IFNA(VLOOKUP(A11,Indywidualna[],2,0),0)","v":0},{"$f":"I11+L11+F11","v":0},{"$f":"J11+M11+G11","v":0},{"$f":"K11+N11+H11","v":0},{"$f":"_xlfn.IFNA(VLOOKUP($A11,Indywidualna[],COLUMNS($F10:F10)+7,0),0)","v":0},{"$f":"_xlfn.IFNA(VLOOKUP($A11,Indywidualna[],COLUMNS($F10:G10)+7,0),0)","v":0},{"$f":"_xlfn.IFNA(VLOOKUP($A11,Indywidualna[],COLUMNS($F10:H10)+7,0),0)","v":0},{"$f":"_xlfn.IFNA(VLOOKUP($A11,Indywidualna[],COLUMNS($F10:I10)+7,0),0)","v":0},{"$f":"_xlfn.IFNA(VLOOKUP($A11,Indywidualna[],COLUMNS($F10:J10)+7,0),0)","v":0},{"$f":"_xlfn.IFNA(VLOOKUP($A11,Indywidualna[],COLUMNS($F10:K10)+7,0),0)","v":0},{"$f":"_xlfn.IFNA(VLOOKUP($A11,Indywidualna[],COLUMNS($F10:L10)+7,0),0)","v":0},{"$f":"_xlfn.IFNA(VLOOKUP($A11,Indywidualna[],COLUMNS($F10:M10)+7,0),0)","v":0},{"$f":"_xlfn.IFNA(VLOOKUP($A11,Indywidualna[],COLUMNS($F10:N10)+7,0),0)","v":0}]
["Podpis Kapitana",null,{"$f":"SUM(C7:C11)","v":7010},{"$f":"SUM(D7:D11)","v":78},{"$f":"SUM(E7:E11)","v":21},{"$f":"SUM(F7:F11)","v":2242},{"$f":"SUM(G7:G11)","v":24},{"$f":"SUM(H7:H11)","v":7},{"$f":"SUM(I7:I11)","v":2343},{"$f":"SUM(J7:J11)","v":27},{"$f":"SUM(K7:K11)","v":6},{"$f":"SUM(L7:L11)","v":2425},{"$f":"SUM(M7:M11)","v":27},{"$f":"SUM(N7:N11)","v":8}]
[]
["Drużyna",null,"RAZEM",null,null,"I SERIA",null,null,"II SERIA",null,null,"III SERIA"]
["MOKSiR Puck II",null,"m.p","w","p","m.p","w","p","m.p","w","p","m.p","w","p"]
[21,{"$f":"_xlfn.IFNA(VLOOKUP(A16,Indywidualna[],2,0),0)","v":"Pawlicki Andrzej"},{"$f":"F16+I16+L16","v":2039},{"$f":"G16+J16+M16","v":22},{"$f":"H16+K16+N16","v":4},{"$f":"_xlfn.IFNA(VLOOKUP($A16,Indywidualna[],COLUMNS($F15:F15)+7,0),0)","v":759},{"$f":"_xlfn.IFNA(VLOOKUP($A16,Indywidualna[],COLUMNS($F15:G15)+7,0),0)","v":7},{"$f":"_xlfn.IFNA(VLOOKUP($A16,Indywidualna[],COLUMNS($F15:H15)+7,0),0)","v":0},{"$f":"_xlfn.IFNA(VLOOKUP($A16,Indywidualna[],COLUMNS($F15:I15)+7,0),0)","v":698},{"$f":"_xlfn.IFNA(VLOOKUP($A16,Indywidualna[],COLUMNS($F15:J15)+7,0),0)","v":8},{"$f":"_xlfn.IFNA(VLOOKUP($A16,Indywidualna[],COLUMNS($F15:K15)+7,0),0)","v":2},{"$f":"_xlfn.IFNA(VLOOKUP($A16,Indywidualna[],COLUMNS($F15:L15)+7,0),0)","v":582},{"$f":"_xlfn.IFNA(VLOOKUP($A16,Indywidualna[],COLUMNS($F15:M15)+7,0),0)","v":7},{"$f":"_xlfn.IFNA(VLOOKUP($A16,Indywidualna[],COLUMNS($F15:N15)+7,0),0)","v":2}]
[22,{"$f":"_xlfn.IFNA(VLOOKUP(A17,Indywidualna[],2,0),0)","v":"Radtke Marek"},{"$f":"F17+I17+L17","v":1684},{"$f":"G17+J17+M17","v":21},{"$f":"H17+K17+N17","v":8},{"$f":"_xlfn.IFNA(VLOOKUP($A17,Indywidualna[],COLUMNS($F16:F16)+7,0),0)","v":400},{"$f":"_xlfn.IFNA(VLOOKUP($A17,Indywidualna[],COLUMNS($F16:G16)+7,0),0)","v":6},{"$f":"_xlfn.IFNA(VLOOKUP($A17,Indywidualna[],COLUMNS($F16:H16)+7,0),0)","v":2},{"$f":"_xlfn.IFNA(VLOOKUP($A17,Indywidualna[],COLUMNS($F16:I16)+7,0),0)","v":492},{"$f":"_xlfn.IFNA(VLOOKUP($A17,Indywidualna[],COLUMNS($F16:J16)+7,0),0)","v":6},{"$f":"_xlfn.IFNA(VLOOKUP($A17,Indywidualna[],COLUMNS($F16:K16)+7,0),0)","v":3},{"$f":"_xlfn.IFNA(VLOOKUP($A17,Indywidualna[],COLUMNS($F16:L16)+7,0),0)","v":792},{"$f":"_xlfn.IFNA(VLOOKUP($A17,Indywidualna[],COLUMNS($F16:M16)+7,0),0)","v":9},{"$f":"_xlfn.IFNA(VLOOKUP($A17,Indywidualna[],COLUMNS($F16:N16)+7,0),0)","v":3}]
[23,{"$f":"_xlfn.IFNA(VLOOKUP(A18,Indywidualna[],2,0),0)","v":"Szczypior Stefan"},{"$f":"F18+I18+L18","v":1197},{"$f":"G18+J18+M18","v":13},{"$f":"H18+K18+N18","v":4},{"$f":"_xlfn.IFNA(VLOOKUP($A18,Indywidualna[],COLUMNS($F17:F17)+7,0),0)","v":22},{"$f":"_xlfn.IFNA(VLOOKUP($A18,Indywidualna[],COLUMNS($F17:G17)+7,0),0)","v":2},{"$f":"_xlfn.IFNA(VLOOKUP($A18,Indywidualna[],COLUMNS($F17:H17)+7,0),0)","v":2},{"$f":"_xlfn.IFNA(VLOOKUP($A18,Indywidualna[],COLUMNS($F17:I17)+7,0),0)","v":539},{"$f":"_xlfn.IFNA(VLOOKUP($A18,Indywidualna[],COLUMNS($F17:J17)+7,0),0)","v":6},{"$f":"_xlfn.IFNA(VLOOKUP($A18,Indywidualna[],COLUMNS($F17:K17)+7,0),0)","v":1},{"$f":"_xlfn.IFNA(VLOOKUP($A18,Indywidualna[],COLUMNS($F17:L17)+7,0),0)","v":636},{"$f":"_xlfn.IFNA(VLOOKUP($A18,Indywidualna[],COLUMNS($F17:M17)+7,0),0)","v":5},{"$f":"_xlfn.IFNA(VLOOKUP($A18,Indywidualna[],COLUMNS($F17:N17)+7,0),0)","v":1}]
[24,{"$f":"_xlfn.IFNA(VLOOKUP(A19,Indywidualna[],2,0),0)","v":"Muża Jan"},{"$f":"F19+I19+L19","v":1933},{"$f":"G19+J19+M19","v":17},{"$f":"H19+K19+N19","v":4},{"$f":"_xlfn.IFNA(VLOOKUP($A19,Indywidualna[],COLUMNS($F18:F18)+7,0),0)","v":904},{"$f":"_xlfn.IFNA(VLOOKUP($A19,Indywidualna[],COLUMNS($F18:G18)+7,0),0)","v":8},{"$f":"_xlfn.IFNA(VLOOKUP($A19,Indywidualna[],COLUMNS($F18:H18)+7,0),0)","v":1},{"$f":"_xlfn.IFNA(VLOOKUP($A19,Indywidualna[],COLUMNS($F18:I18)+7,0),0)","v":553},{"$f":"_xlfn.IFNA(VLOOKUP($A19,Indywidualna[],COLUMNS($F18:J18)+7,0),0)","v":4},{"$f":"_xlfn.IFNA(VLOOKUP($A19,Indywidualna[],COLUMNS($F18:K18)+7,0),0)","v":1},{"$f":"_xlfn.IFNA(VLOOKUP($A19,Indywidualna[],COLUMNS($F18:L18)+7,0),0)","v":476},{"$f":"_xlfn.IFNA(VLOOKUP($A19,Indywidualna[],COLUMNS($F18:M18)+7,0),0)","v":5},{"$f":"_xlfn.IFNA(VLOOKUP($A19,Indywidualna[],COLUMNS($F18:N18)+7,0),0)","v":2}]
[null,{"$f":"_xlfn.IFNA(VLOOKUP(A20,Indywidualna[],2,0),0)","v":0},{"$f":"F20+I20+L20","v":0},{"$f":"G20+J20+M20","v":0},{"$f":"H20+K20+N20","v":0},{"$f":"_xlfn.IFNA(VLOOKUP($A20,Indywidualna[],COLUMNS($F19:F19)+7,0),0)","v":0},{"$f":"_xlfn.IFNA(VLOOKUP($A20,Indywidualna[],COLUMNS($F19:G19)+7,0),0)","v":0},{"$f":"_xlfn.IFNA(VLOOKUP($A20,Indywidualna[],COLUMNS($F19:H19)+7,0),0)","v":0},{"$f":"_xlfn.IFNA(VLOOKUP($A20,Indywidualna[],COLUMNS($F19:I19)+7,0),0)","v":0},{"$f":"_xlfn.IFNA(VLOOKUP($A20,Indywidualna[],COLUMNS($F19:J19)+7,0),0)","v":0},{"$f":"_xlfn.IFNA(VLOOKUP($A20,Indywidualna[],COLUMNS($F19:K19)+7,0),0)","v":0},{"$f":"_xlfn.IFNA(VLOOKUP($A20,Indywidualna[],COLUMNS($F19:L19)+7,0),0)","v":0},{"$f":"_xlfn.IFNA(VLOOKUP($A20,Indywidualna[],COLUMNS($F19:M19)+7,0),0)","v":0},{"$f":"_xlfn.IFNA(VLOOKUP($A20,Indywidualna[],COLUMNS($F19:N19)+7,0),0)","v":0}]
["Podpis Kapitana",null,{"$f":"SUM(C16:C20)","v":6853},{"$f":"SUM(D16:D20)","v":73},{"$f":"SUM(E16:E20)","v":20},{"$f":"SUM(F16:F20)","v":2085},{"$f":"SUM(G16:G20)","v":23},{"$f":"SUM(H16:H20)","v":5},{"$f":"SUM(I16:I20)","v":2282},{"$f":"SUM(J16:J20)","v":24},{"$f":"SUM(K16:K20)","v":7},{"$f":"SUM(L16:L20)","v":2486},{"$f":"SUM(M16:M20)","v":26},{"$f":"SUM(N16:N20)","v":8}]
[]
["Drużyna",null,"RAZEM",null,null,"I SERIA",null,null,"II SERIA",null,null,"III SERIA"]
["KS KRAJNA Złotów II",null,"m.p","w","p","m.p","w","p","m.p","w","p","m.p","w","p"]
[13,{"$f":"_xlfn.IFNA(VLOOKUP(A25,Indywidualna[],2,0),0)","v":"Kowalski Konrad"},{"$f":"F25+I25+L25","v":1318},{"$f":"G25+J25+M25","v":22},{"$f":"H25+K25+N25","v":9},{"$f":"_xlfn.IFNA(VLOOKUP($A25,Indywidualna[],COLUMNS($F24:F24)+7,0),0)","v":774},{"$f":"_xlfn.IFNA(VLOOKUP($A25,Indywidualna[],COLUMNS($F24:G24)+7,0),0)","v":9},{"$f":"_xlfn.IFNA(VLOOKUP($A25,Indywidualna[],COLUMNS($F24:H24)+7,0),0)","v":1},{"$f":"_xlfn.IFNA(VLOOKUP($A25,Indywidualna[],COLUMNS($F24:I24)+7,0),0)","v":164},{"$f":"_xlfn.IFNA(VLOOKUP($A25,Indywidualna[],COLUMNS($F24:J24)+7,0),0)","v":6},{"$f":"_xlfn.IFNA(VLOOKUP($A25,Indywidualna[],COLUMNS($F24:K24)+7,0),0)","v":4},{"$f":"_xlfn.IFNA(VLOOKUP($A25,Indywidualna[],COLUMNS($F24:L24)+7,0),0)","v":380},{"$f":"_xlfn.IFNA(VLOOKUP($A25,Indywidualna[],COLUMNS($F24:M24)+7,0),0)","v":7},{"$f":"_xlfn.IFNA(VLOOKUP($A25,Indywidualna[],COLUMNS($F24:N24)+7,0),0)","v":4}]
[14,{"$f":"_xlfn.IFNA(VLOOKUP(A26,Indywidualna[],2,0),0)","v":"Bełka Jan"},{"$f":"F26+I26+L26","v":1761},{"$f":"G26+J26+M26","v":22},{"$f":"H26+K26+N26","v":8},{"$f":"_xlfn.IFNA(VLOOKUP($A26,Indywidualna[],COLUMNS($F25:F25)+7,0),0)","v":1130},{"$f":"_xlfn.IFNA(VLOOKUP($A26,Indywidualna[],COLUMNS($F25:G25)+7,0),0)","v":12},{"$f":"_xlfn.IFNA(VLOOKUP($A26,Indywidualna[],COLUMNS($F25:H25)+7,0),0)","v":2},{"$f":"_xlfn.IFNA(VLOOKUP($A26,Indywidualna[],COLUMNS($F25:I25)+7,0),0)","v":254},{"$f":"_xlfn.IFNA(VLOOKUP($A26,Indywidualna[],COLUMNS($F25:J25)+7,0),0)","v":7},{"$f":"_xlfn.IFNA(VLOOKUP($A26,Indywidualna[],COLUMNS($F25:K25)+7,0),0)","v":4},{"$f":"_xlfn.IFNA(VLOOKUP($A26,Indywidualna[],COLUMNS($F25:L25)+7,0),0)","v":377},{"$f":"_xlfn.IFNA(VLOOKUP($A26,Indywidualna[],COLUMNS($F25:M25)+7,0),0)","v":3},{"$f":"_xlfn.IFNA(VLOOKUP($A26,Indywidualna[],COLUMNS($F25:N25)+7,0),0)","v":2}]
[15,{"$f":"_xlfn.IFNA(VLOOKUP(A27,Indywidualna[],2,0),0)","v":"Piasecki Jan"},{"$f":"F27+I27+L27","v":2438},{"$f":"G27+J27+M27","v":26},{"$f":"H27+K27+N27","v":5},{"$f":"_xlfn.IFNA(VLOOKUP($A27,Indywidualna[],COLUMNS($F26:F26)+7,0),0)","v":848},{"$f":"_xlfn.IFNA(VLOOKUP($A27,Indywidualna[],COLUMNS($F26:G26)+7,0),0)","v":8},{"$f":"_xlfn.IFNA(VLOOKUP($A27,Indywidualna[],COLUMNS($F26:H26)+7,0),0)","v":1},{"$f":"_xlfn.IFNA(VLOOKUP($A27,Indywidualna[],COLUMNS($F26:I26)+7,0),0)","v":626},{"$f":"_xlfn.IFNA(VLOOKUP($A27,Indywidualna[],COLUMNS($F26:J26)+7,0),0)","v":7},{"$f":"_xlfn.IFNA(VLOOKUP($A27,Indywidualna[],COLUMNS($F26:K26)+7,0),0)","v":2},{"$f":"_xlfn.IFNA(VLOOKUP($A27,Indywidualna[],COLUMNS($F26:L26)+7,0),0)","v":964},{"$f":"_xlfn.IFNA(VLOOKUP($A27,Indywidualna[],COLUMNS($F26:M26)+7,0),0)","v":11},{"$f":"_xlfn.IFNA(VLOOKUP($A27,Indywidualna[],COLUMNS($F26:N26)+7,0),0)","v":2}]
[16,{"$f":"_xlfn.IFNA(VLOOKUP(A28,Indywidualna[],2,0),0)","v":"Kazimierowski Stanisław"},{"$f":"F28+I28+L28","v":1026},{"$f":"G28+J28+M28","v":15},{"$f":"H28+K28+N28","v":7},{"$f":"_xlfn.IFNA(VLOOKUP($A28,Indywidualna[],COLUMNS($F27:F27)+7,0),0)","v":91},{"$f":"_xlfn.IFNA(VLOOKUP($A28,Indywidualna[],COLUMNS($F27:G27)+7,0),0)","v":5},{"$f":"_xlfn.IFNA(VLOOKUP($A28,Indywidualna[],COLUMNS($F27:H27)+7,0),0)","v":5},{"$f":"_xlfn.IFNA(VLOOKUP($A28,Indywidualna[],COLUMNS($F27:I27)+7,0),0)","v":535},{"$f":"_xlfn.IFNA(VLOOKUP($A28,Indywidualna[],COLUMNS($F27:J27)+7,0),0)","v":5},{"$f":"_xlfn.IFNA(VLOOKUP($A28,Indywidualna[],COLUMNS($F27:K27)+7,0),0)","v":1},{"$f":"_xlfn.IFNA(VLOOKUP($A28,Indywidualna[],COLUMNS($F27:L27)+7,0),0)","v":400},{"$f":"_xlfn.IFNA(VLOOKUP($A28,Indywidualna[],COLUMNS($F27:M27)+7,0),0)","v":5},{"$f":"_xlfn.IFNA(VLOOKUP($A28,Indywidualna[],COLUMNS($F27:N27)+7,0),0)","v":1}]
[null,{"$f":"_xlfn.IFNA(VLOOKUP(A29,Indywidualna[],2,0),0)","v":0},{"$f":"F29+I29+L29","v":0},{"$f":"G29+J29+M29","v":0},{"$f":"H29+K29+N29","v":0},{"$f":"_xlfn.IFNA(VLOOKUP($A29,Indywidualna[],COLUMNS($F28:F28)+7,0),0)","v":0},{"$f":"_xlfn.IFNA(VLOOKUP($A29,Indywidualna[],COLUMNS($F28:G28)+7,0),0)","v":0},{"$f":"_xlfn.IFNA(VLOOKUP($A29,Indywidualna[],COLUMNS($F28:H28)+7,0),0)","v":0},{"$f":"_xlfn.IFNA(VLOOKUP($A29,Indywidualna[],COLUMNS($F28:I28)+7,0),0)","v":0},{"$f":"_xlfn.IFNA(VLOOKUP($A29,Indywidualna[],COLUMNS($F28:J28)+7,0),0)","v":0},{"$f":"_xlfn.IFNA(VLOOKUP($A29,Indywidualna[],COLUMNS($F28:K28)+7,0),0)","v":0},{"$f":"_xlfn.IFNA(VLOOKUP($A29,Indywidualna[],COLUMNS($F28:L28)+7,0),0)","v":0},{"$f":"_xlfn.IFNA(VLOOKUP($A29,Indywidualna[],COLUMNS($F28:M28)+7,0),0)","v":0},{"$f":"_xlfn.IFNA(VLOOKUP($A29,Indywidualna[],COLUMNS($F28:N28)+7,0),0)","v":0}]
["Podpis Kapitana",null,{"$f":"SUM(C25:C29)","v":6543},{"$f":"SUM(D25:D29)","v":85},{"$f":"SUM(E25:E29)","v":29},{"$f":"SUM(F25:F29)","v":2843},{"$f":"SUM(G25:G29)","v":34},{"$f":"SUM(H25:H29)","v":9},{"$f":"SUM(I25:I29)","v":1579},{"$f":"SUM(J25:J29)","v":25},{"$f":"SUM(K25:K29)","v":11},{"$f":"SUM(L25:L29)","v":2121},{"$f":"SUM(M25:M29)","v":26},{"$f":"SUM(N25:N29)","v":9}]
[]
["Drużyna",null,"RAZEM",null,null,"I SERIA",null,null,"II SERIA",null,null,"III SERIA"]
["S.K. FAMILY Dziemiany",null,"m.p","w","p","m.p","w","p","m.p","w","p","m.p","w","p"]
[25,{"$f":"_xlfn.IFNA(VLOOKUP(A34,Indywidualna[],2,0),0)","v":"Mikołajczyk Paweł"},{"$f":"F34+I34+L34","v":1921},{"$f":"G34+J34+M34","v":22},{"$f":"H34+K34+N34","v":8},{"$f":"_xlfn.IFNA(VLOOKUP($A34,Indywidualna[],COLUMNS($F33:F33)+7,0),0)","v":563},{"$f":"_xlfn.IFNA(VLOOKUP($A34,Indywidualna[],COLUMNS($F33:G33)+7,0),0)","v":7},{"$f":"_xlfn.IFNA(VLOOKUP($A34,Indywidualna[],COLUMNS($F33:H33)+7,0),0)","v":2},{"$f":"_xlfn.IFNA(VLOOKUP($A34,Indywidualna[],COLUMNS($F33:I33)+7,0),0)","v":730},{"$f":"_xlfn.IFNA(VLOOKUP($A34,Indywidualna[],COLUMNS($F33:J33)+7,0),0)","v":7},{"$f":"_xlfn.IFNA(VLOOKUP($A34,Indywidualna[],COLUMNS($F33:K33)+7,0),0)","v":3},{"$f":"_xlfn.IFNA(VLOOKUP($A34,Indywidualna[],COLUMNS($F33:L33)+7,0),0)","v":628},{"$f":"_xlfn.IFNA(VLOOKUP($A34,Indywidualna[],COLUMNS($F33:M33)+7,0),0)","v":8},{"$f":"_xlfn.IFNA(VLOOKUP($A34,Indywidualna[],COLUMNS($F33:N33)+7,0),0)","v":3}]
[26,{"$f":"_xlfn.IFNA(VLOOKUP(A35,Indywidualna[],2,0),0)","v":"Mikołajczyk Rafał"},{"$f":"F35+I35+L35","v":2293},{"$f":"G35+J35+M35","v":28},{"$f":"H35+K35+N35","v":5},{"$f":"_xlfn.IFNA(VLOOKUP($A35,Indywidualna[],COLUMNS($F34:F34)+7,0),0)","v":590},{"$f":"_xlfn.IFNA(VLOOKUP($A35,Indywidualna[],COLUMNS($F34:G34)+7,0),0)","v":7},{"$f":"_xlfn.IFNA(VLOOKUP($A35,Indywidualna[],COLUMNS($F34:H34)+7,0),0)","v":1},{"$f":"_xlfn.IFNA(VLOOKUP($A35,Indywidualna[],COLUMNS($F34:I34)+7,0),0)","v":995},{"$f":"_xlfn.IFNA(VLOOKUP($A35,Indywidualna[],COLUMNS($F34:J34)+7,0),0)","v":10},{"$f":"_xlfn.IFNA(VLOOKUP($A35,Indywidualna[],COLUMNS($F34:K34)+7,0),0)","v":1},{"$f":"_xlfn.IFNA(VLOOKUP($A35,Indywidualna[],COLUMNS($F34:L34)+7,0),0)","v":708},{"$f":"_xlfn.IFNA(VLOOKUP($A35,Indywidualna[],COLUMNS($F34:M34)+7,0),0)","v":11},{"$f":"_xlfn.IFNA(VLOOKUP($A35,Indywidualna[],COLUMNS($F34:N34)+7,0),0)","v":3}]
[27,{"$f":"_xlfn.IFNA(VLOOKUP(A36,Indywidualna[],2,0),0)","v":"Mikołajczyk Tomasz"},{"$f":"F36+I36+L36","v":2326},{"$f":"G36+J36+M36","v":25},{"$f":"H36+K36+N36","v":5},{"$f":"_xlfn.IFNA(VLOOKUP($A36,Indywidualna[],COLUMNS($F35:F35)+7,0),0)","v":1322},{"$f":"_xlfn.IFNA(VLOOKUP($A36,Indywidualna[],COLUMNS($F35:G35)+7,0),0)","v":11},{"$f":"_xlfn.IFNA(VLOOKUP($A36,Indywidualna[],COLUMNS($F35:H35)+7,0),0)","v":0},{"$f":"_xlfn.IFNA(VLOOKUP($A36,Indywidualna[],COLUMNS($F35:I35)+7,0),0)","v":395},{"$f":"_xlfn.IFNA(VLOOKUP($A36,Indywidualna[],COLUMNS($F35:J35)+7,0),0)","v":5},{"$f":"_xlfn.IFNA(VLOOKUP($A36,Indywidualna[],COLUMNS($F35:K35)+7,0),0)","v":1},{"$f":"_xlfn.IFNA(VLOOKUP($A36,Indywidualna[],COLUMNS($F35:L35)+7,0),0)","v":609},{"$f":"_xlfn.IFNA(VLOOKUP($A36,Indywidualna[],COLUMNS($F35:M35)+7,0),0)","v":9},{"$f":"_xlfn.IFNA(VLOOKUP($A36,Indywidualna[],COLUMNS($F35:N35)+7,0),0)","v":4}]
[28,{"$f":"_xlfn.IFNA(VLOOKUP(A37,Indywidualna[],2,0),0)","v":"Kujawski Łukasz"},{"$f":"F37+I37+L37","v":1349},{"$f":"G37+J37+M37","v":19},{"$f":"H37+K37+N37","v":7},{"$f":"_xlfn.IFNA(VLOOKUP($A37,Indywidualna[],COLUMNS($F36:F36)+7,0),0)","v":70},{"$f":"_xlfn.IFNA(VLOOKUP($A37,Indywidualna[],COLUMNS($F36:G36)+7,0),0)","v":4},{"$f":"_xlfn.IFNA(VLOOKUP($A37,Indywidualna[],COLUMNS($F36:H36)+7,0),0)","v":4},{"$f":"_xlfn.IFNA(VLOOKUP($A37,Indywidualna[],COLUMNS($F36:I36)+7,0),0)","v":644},{"$f":"_xlfn.IFNA(VLOOKUP($A37,Indywidualna[],COLUMNS($F36:J36)+7,0),0)","v":7},{"$f":"_xlfn.IFNA(VLOOKUP($A37,Indywidualna[],COLUMNS($F36:K36)+7,0),0)","v":0},{"$f":"_xlfn.IFNA(VLOOKUP($A37,Indywidualna[],COLUMNS($F36:L36)+7,0),0)","v":635},{"$f":"_xlfn.IFNA(VLOOKUP($A37,Indywidualna[],COLUMNS($F36:M36)+7,0),0)","v":8},{"$f":"_xlfn.IFNA(VLOOKUP($A37,Indywidualna[],COLUMNS($F36:N36)+7,0),0)","v":3}]
[null,{"$f":"_xlfn.IFNA(VLOOKUP(A38,Indywidualna[],2,0),0)","v":0},{"$f":"F38+I38+L38","v":0},{"$f":"G38+J38+M38","v":0},{"$f":"H38+K38+N38","v":0},{"$f":"_xlfn.IFNA(VLOOKUP($A38,Indywidualna[],COLUMNS($F37:F37)+7,0),0)","v":0},{"$f":"_xlfn.IFNA(VLOOKUP($A38,Indywidualna[],COLUMNS($F37:G37)+7,0),0)","v":0},{"$f":"_xlfn.IFNA(VLOOKUP($A38,Indywidualna[],COLUMNS($F37:H37)+7,0),0)","v":0},{"$f":"_xlfn.IFNA(VLOOKUP($A38,Indywidualna[],COLUMNS($F37:I37)+7,0),0)","v":0},{"$f":"_xlfn.IFNA(VLOOKUP($A38,Indywidualna[],COLUMNS($F37:J37)+7,0),0)","v":0},{"$f":"_xlfn.IFNA(VLOOKUP($A38,Indywidualna[],COLUMNS($F37:K37)+7,0),0)","v":0},{"$f":"_xlfn.IFNA(VLOOKUP($A38,Indywidualna[],COLUMNS($F37:L37)+7,0),0)","v":0},{"$f":"_xlfn.IFNA(VLOOKUP($A38,Indywidualna[],COLUMNS($F37:M37)+7,0),0)","v":0},{"$f":"_xlfn.IFNA(VLOOKUP($A38,Indywidualna[],COLUMNS($F37:N37)+7,0),0)","v":0}]
["Podpis Kapitana",null,{"$f":"SUM(C34:C38)","v":7889},{"$f":"SUM(D34:D38)","v":94},{"$f":"SUM(E34:E38)","v":25},{"$f":"SUM(F34:F38)","v":2545},{"$f":"SUM(G34:G38)","v":29},{"$f":"SUM(H34:H38)","v":7},{"$f":"SUM(I34:I38)","v":2764},{"$f":"SUM(J34:J38)","v":29},{"$f":"SUM(K34:K38)","v":5},{"$f":"SUM(L34:L38)","v":2580},{"$f":"SUM(M34:M38)","v":36},{"$f":"SUM(N34:N38)","v":13}]
[]
["Drużyna",null,"RAZEM",null,null,"I SERIA",null,null,"II SERIA",null,null,"III SERIA"]
["FALA Świekatowo",null,"m.p","w","p","m.p","w","p","m.p","w","p","m.p","w","p"]
[1,{"$f":"_xlfn.IFNA(VLOOKUP(A43,Indywidualna[],2,0),0)","v":"Szneidrowski Marek"},{"$f":"F43+I43+L43","v":2104},{"$f":"G43+J43+M43","v":17},{"$f":"H43+K43+N43","v":0},{"$f":"_xlfn.IFNA(VLOOKUP($A43,Indywidualna[],COLUMNS($F42:F42)+7,0),0)","v":449},{"$f":"_xlfn.IFNA(VLOOKUP($A43,Indywidualna[],COLUMNS($F42:G42)+7,0),0)","v":3},{"$f":"_xlfn.IFNA(VLOOKUP($A43,Indywidualna[],COLUMNS($F42:H42)+7,0),0)","v":0},{"$f":"_xlfn.IFNA(VLOOKUP($A43,Indywidualna[],COLUMNS($F42:I42)+7,0),0)","v":857},{"$f":"_xlfn.IFNA(VLOOKUP($A43,Indywidualna[],COLUMNS($F42:J42)+7,0),0)","v":7},{"$f":"_xlfn.IFNA(VLOOKUP($A43,Indywidualna[],COLUMNS($F42:K42)+7,0),0)","v":0},{"$f":"_xlfn.IFNA(VLOOKUP($A43,Indywidualna[],COLUMNS($F42:L42)+7,0),0)","v":798},{"$f":"_xlfn.IFNA(VLOOKUP($A43,Indywidualna[],COLUMNS($F42:M42)+7,0),0)","v":7},{"$f":"_xlfn.IFNA(VLOOKUP($A43,Indywidualna[],COLUMNS($F42:N42)+7,0),0)","v":0}]
[2,{"$f":"_xlfn.IFNA(VLOOKUP(A44,Indywidualna[],2,0),0)","v":"Glama Stanisław"},{"$f":"F44+I44+L44","v":2288},{"$f":"G44+J44+M44","v":26},{"$f":"H44+K44+N44","v":5},{"$f":"_xlfn.IFNA(VLOOKUP($A44,Indywidualna[],COLUMNS($F43:F43)+7,0),0)","v":890},{"$f":"_xlfn.IFNA(VLOOKUP($A44,Indywidualna[],COLUMNS($F43:G43)+7,0),0)","v":7},{"$f":"_xlfn.IFNA(VLOOKUP($A44,Indywidualna[],COLUMNS($F43:H43)+7,0),0)","v":0},{"$f":"_xlfn.IFNA(VLOOKUP($A44,Indywidualna[],COLUMNS($F43:I43)+7,0),0)","v":941},{"$f":"_xlfn.IFNA(VLOOKUP($A44,Indywidualna[],COLUMNS($F43:J43)+7,0),0)","v":12},{"$f":"_xlfn.IFNA(VLOOKUP($A44,Indywidualna[],COLUMNS($F43:K43)+7,0),0)","v":2},{"$f":"_xlfn.IFNA(VLOOKUP($A44,Indywidualna[],COLUMNS($F43:L43)+7,0),0)","v":457},{"$f":"_xlfn.IFNA(VLOOKUP($A44,Indywidualna[],COLUMNS($F43:M43)+7,0),0)","v":7},{"$f":"_xlfn.IFNA(VLOOKUP($A44,Indywidualna[],COLUMNS($F43:N43)+7,0),0)","v":3}]
[3,{"$f":"_xlfn.IFNA(VLOOKUP(A45,Indywidualna[],2,0),0)","v":"Moch Ireneusz"},{"$f":"F45+I45+L45","v":2551},{"$f":"G45+J45+M45","v":25},{"$f":"H45+K45+N45","v":1},{"$f":"_xlfn.IFNA(VLOOKUP($A45,Indywidualna[],COLUMNS($F44:F44)+7,0),0)","v":1102},{"$f":"_xlfn.IFNA(VLOOKUP($A45,Indywidualna[],COLUMNS($F44:G44)+7,0),0)","v":10},{"$f":"_xlfn.IFNA(VLOOKUP($A45,Indywidualna[],COLUMNS($F44:H44)+7,0),0)","v":0},{"$f":"_xlfn.IFNA(VLOOKUP($A45,Indywidualna[],COLUMNS($F44:I44)+7,0),0)","v":1069},{"$f":"_xlfn.IFNA(VLOOKUP($A45,Indywidualna[],COLUMNS($F44:J44)+7,0),0)","v":10},{"$f":"_xlfn.IFNA(VLOOKUP($A45,Indywidualna[],COLUMNS($F44:K44)+7,0),0)","v":0},{"$f":"_xlfn.IFNA(VLOOKUP($A45,Indywidualna[],COLUMNS($F44:L44)+7,0),0)","v":380},{"$f":"_xlfn.IFNA(VLOOKUP($A45,Indywidualna[],COLUMNS($F44:M44)+7,0),0)","v":5},{"$f":"_xlfn.IFNA(VLOOKUP($A45,Indywidualna[],COLUMNS($F44:N44)+7,0),0)","v":1}]
[4,{"$f":"_xlfn.IFNA(VLOOKUP(A46,Indywidualna[],2,0),0)","v":"Szatkowski Mirosław"},{"$f":"F46+I46+L46","v":2120},{"$f":"G46+J46+M46","v":29},{"$f":"H46+K46+N46","v":8},{"$f":"_xlfn.IFNA(VLOOKUP($A46,Indywidualna[],COLUMNS($F45:F45)+7,0),0)","v":890},{"$f":"_xlfn.IFNA(VLOOKUP($A46,Indywidualna[],COLUMNS($F45:G45)+7,0),0)","v":9},{"$f":"_xlfn.IFNA(VLOOKUP($A46,Indywidualna[],COLUMNS($F45:H45)+7,0),0)","v":1},{"$f":"_xlfn.IFNA(VLOOKUP($A46,Indywidualna[],COLUMNS($F45:I45)+7,0),0)","v":530},{"$f":"_xlfn.IFNA(VLOOKUP($A46,Indywidualna[],COLUMNS($F45:J45)+7,0),0)","v":10},{"$f":"_xlfn.IFNA(VLOOKUP($A46,Indywidualna[],COLUMNS($F45:K45)+7,0),0)","v":4},{"$f":"_xlfn.IFNA(VLOOKUP($A46,Indywidualna[],COLUMNS($F45:L45)+7,0),0)","v":700},{"$f":"_xlfn.IFNA(VLOOKUP($A46,Indywidualna[],COLUMNS($F45:M45)+7,0),0)","v":10},{"$f":"_xlfn.IFNA(VLOOKUP($A46,Indywidualna[],COLUMNS($F45:N45)+7,0),0)","v":3}]
[null,{"$f":"_xlfn.IFNA(VLOOKUP(A47,Indywidualna[],2,0),0)","v":0},{"$f":"F47+I47+L47","v":0},{"$f":"G47+J47+M47","v":0},{"$f":"H47+K47+N47","v":0},{"$f":"_xlfn.IFNA(VLOOKUP($A47,Indywidualna[],COLUMNS($F46:F46)+7,0),0)","v":0},{"$f":"_xlfn.IFNA(VLOOKUP($A47,Indywidualna[],COLUMNS($F46:G46)+7,0),0)","v":0},{"$f":"_xlfn.IFNA(VLOOKUP($A47,Indywidualna[],COLUMNS($F46:H46)+7,0),0)","v":0},{"$f":"_xlfn.IFNA(VLOOKUP($A47,Indywidualna[],COLUMNS($F46:I46)+7,0),0)","v":0},{"$f":"_xlfn.IFNA(VLOOKUP($A47,Indywidualna[],COLUMNS($F46:J46)+7,0),0)","v":0},{"$f":"_xlfn.IFNA(VLOOKUP($A47,Indywidualna[],COLUMNS($F46:K46)+7,0),0)","v":0},{"$f":"_xlfn.IFNA(VLOOKUP($A47,Indywidualna[],COLUMNS($F46:L46)+7,0),0)","v":0},{"$f":"_xlfn.IFNA(VLOOKUP($A47,Indywidualna[],COLUMNS($F46:M46)+7,0),0)","v":0},{"$f":"_xlfn.IFNA(VLOOKUP($A47,Indywidualna[],COLUMNS($F46:N46)+7,0),0)","v":0}]
["Podpis Kapitana",null,{"$f":"SUM(C43:C47)","v":9063},{"$f":"SUM(D43:D47)","v":97},{"$f":"SUM(E43:E47)","v":14},{"$f":"SUM(F43:F47)","v":3331},{"$f":"SUM(G43:G47)","v":29},{"$f":"SUM(H43:H47)","v":1},{"$f":"SUM(I43:I47)","v":3397},{"$f":"SUM(J43:J47)","v":39},{"$f":"SUM(K43:K47)","v":6},{"$f":"SUM(L43:L47)","v":2335},{"$f":"SUM(M43:M47)","v":29},{"$f":"SUM(N43:N47)","v":7}]
[]
["Drużyna",null,"RAZEM",null,null,"I SERIA",null,null,"II SERIA",null,null,"III SERIA"]
["GOKSiR Liniewo",null,"m.p","w","p","m.p","w","p","m.p","w","p","m.p","w","p"]
[5,{"$f":"_xlfn.IFNA(VLOOKUP(A52,Indywidualna[],2,0),0)","v":"Narloch Stanisław"},{"$f":"F52+I52+L52","v":2104},{"$f":"G52+J52+M52","v":24},{"$f":"H52+K52+N52","v":6},{"$f":"_xlfn.IFNA(VLOOKUP($A52,Indywidualna[],COLUMNS($F51:F51)+7,0),0)","v":558},{"$f":"_xlfn.IFNA(VLOOKUP($A52,Indywidualna[],COLUMNS($F51:G51)+7,0),0)","v":6},{"$f":"_xlfn.IFNA(VLOOKUP($A52,Indywidualna[],COLUMNS($F51:H51)+7,0),0)","v":1},{"$f":"_xlfn.IFNA(VLOOKUP($A52,Indywidualna[],COLUMNS($F51:I51)+7,0),0)","v":1510},{"$f":"_xlfn.IFNA(VLOOKUP($A52,Indywidualna[],COLUMNS($F51:J51)+7,0),0)","v":14},{"$f":"_xlfn.IFNA(VLOOKUP($A52,Indywidualna[],COLUMNS($F51:K51)+7,0),0)","v":0},{"$f":"_xlfn.IFNA(VLOOKUP($A52,Indywidualna[],COLUMNS($F51:L51)+7,0),0)","v":36},{"$f":"_xlfn.IFNA(VLOOKUP($A52,Indywidualna[],COLUMNS($F51:M51)+7,0),0)","v":4},{"$f":"_xlfn.IFNA(VLOOKUP($A52,Indywidualna[],COLUMNS($F51:N51)+7,0),0)","v":5}]
[6,{"$f":"_xlfn.IFNA(VLOOKUP(A53,Indywidualna[],2,0),0)","v":"Gostomski Zenon"},{"$f":"F53+I53+L53","v":1412},{"$f":"G53+J53+M53","v":10},{"$f":"H53+K53+N53","v":1},{"$f":"_xlfn.IFNA(VLOOKUP($A53,Indywidualna[],COLUMNS($F52:F52)+7,0),0)","v":540},{"$f":"_xlfn.IFNA(VLOOKUP($A53,Indywidualna[],COLUMNS($F52:G52)+7,0),0)","v":6},{"$f":"_xlfn.IFNA(VLOOKUP($A53,Indywidualna[],COLUMNS($F52:H52)+7,0),0)","v":1},{"$f":"_xlfn.IFNA(VLOOKUP($A53,Indywidualna[],COLUMNS($F52:I52)+7,0),0)","v":392},{"$f":"_xlfn.IFNA(VLOOKUP($A53,Indywidualna[],COLUMNS($F52:J52)+7,0),0)","v":1},{"$f":"_xlfn.IFNA(VLOOKUP($A53,Indywidualna[],COLUMNS($F52:K52)+7,0),0)","v":0},{"$f":"_xlfn.IFNA(VLOOKUP($A53,Indywidualna[],COLUMNS($F52:L52)+7,0),0)","v":480},{"$f":"_xlfn.IFNA(VLOOKUP($A53,Indywidualna[],COLUMNS($F52:M52)+7,0),0)","v":3},{"$f":"_xlfn.IFNA(VLOOKUP($A53,Indywidualna[],COLUMNS($F52:N52)+7,0),0)","v":0}]
[7,{"$f":"_xlfn.IFNA(VLOOKUP(A54,Indywidualna[],2,0),0)","v":"Wirkus Józef"},{"$f":"F54+I54+L54","v":1494},{"$f":"G54+J54+M54","v":16},{"$f":"H54+K54+N54","v":4},{"$f":"_xlfn.IFNA(VLOOKUP($A54,Indywidualna[],COLUMNS($F53:F53)+7,0),0)","v":353},{"$f":"_xlfn.IFNA(VLOOKUP($A54,Indywidualna[],COLUMNS($F53:G53)+7,0),0)","v":6},{"$f":"_xlfn.IFNA(VLOOKUP($A54,Indywidualna[],COLUMNS($F53:H53)+7,0),0)","v":2},{"$f":"_xlfn.IFNA(VLOOKUP($A54,Indywidualna[],COLUMNS($F53:I53)+7,0),0)","v":293},{"$f":"_xlfn.IFNA(VLOOKUP($A54,Indywidualna[],COLUMNS($F53:J53)+7,0),0)","v":3},{"$f":"_xlfn.IFNA(VLOOKUP($A54,Indywidualna[],COLUMNS($F53:K53)+7,0),0)","v":2},{"$f":"_xlfn.IFNA(VLOOKUP($A54,Indywidualna[],COLUMNS($F53:L53)+7,0),0)","v":848},{"$f":"_xlfn.IFNA(VLOOKUP($A54,Indywidualna[],COLUMNS($F53:M53)+7,0),0)","v":7},{"$f":"_xlfn.IFNA(VLOOKUP($A54,Indywidualna[],COLUMNS($F53:N53)+7,0),0)","v":0}]
[8,{"$f":"_xlfn.IFNA(VLOOKUP(A55,Indywidualna[],2,0),0)","v":"Wróbel Teresa"},{"$f":"F55+I55+L55","v":1913},{"$f":"G55+J55+M55","v":19},{"$f":"H55+K55+N55","v":5},{"$f":"_xlfn.IFNA(VLOOKUP($A55,Indywidualna[],COLUMNS($F54:F54)+7,0),0)","v":759},{"$f":"_xlfn.IFNA(VLOOKUP($A55,Indywidualna[],COLUMNS($F54:G54)+7,0),0)","v":7},{"$f":"_xlfn.IFNA(VLOOKUP($A55,Indywidualna[],COLUMNS($F54:H54)+7,0),0)","v":1},{"$f":"_xlfn.IFNA(VLOOKUP($A55,Indywidualna[],COLUMNS($F54:I54)+7,0),0)","v":720},{"$f":"_xlfn.IFNA(VLOOKUP($A55,Indywidualna[],COLUMNS($F54:J54)+7,0),0)","v":8},{"$f":"_xlfn.IFNA(VLOOKUP($A55,Indywidualna[],COLUMNS($F54:K54)+7,0),0)","v":3},{"$f":"_xlfn.IFNA(VLOOKUP($A55,Indywidualna[],COLUMNS($F54:L54)+7,0),0)","v":434},{"$f":"_xlfn.IFNA(VLOOKUP($A55,Indywidualna[],COLUMNS($F54:M54)+7,0),0)","v":4},{"$f":"_xlfn.IFNA(VLOOKUP($A55,Indywidualna[],COLUMNS($F54:N54)+7,0),0)","v":1}]
[null,{"$f":"_xlfn.IFNA(VLOOKUP(A56,Indywidualna[],2,0),0)","v":0},{"$f":"F56+I56+L56","v":0},{"$f":"G56+J56+M56","v":0},{"$f":"H56+K56+N56","v":0},{"$f":"_xlfn.IFNA(VLOOKUP($A56,Indywidualna[],COLUMNS($F55:F55)+7,0),0)","v":0},{"$f":"_xlfn.IFNA(VLOOKUP($A56,Indywidualna[],COLUMNS($F55:G55)+7,0),0)","v":0},{"$f":"_xlfn.IFNA(VLOOKUP($A56,Indywidualna[],COLUMNS($F55:H55)+7,0),0)","v":0},{"$f":"_xlfn.IFNA(VLOOKUP($A56,Indywidualna[],COLUMNS($F55:I55)+7,0),0)","v":0},{"$f":"_xlfn.IFNA(VLOOKUP($A56,Indywidualna[],COLUMNS($F55:J55)+7,0),0)","v":0},{"$f":"_xlfn.IFNA(VLOOKUP($A56,Indywidualna[],COLUMNS($F55:K55)+7,0),0)","v":0},{"$f":"_xlfn.IFNA(VLOOKUP($A56,Indywidualna[],COLUMNS($F55:L55)+7,0),0)","v":0},{"$f":"_xlfn.IFNA(VLOOKUP($A56,Indywidualna[],COLUMNS($F55:M55)+7,0),0)","v":0},{"$f":"_xlfn.IFNA(VLOOKUP($A56,Indywidualna[],COLUMNS($F55:N55)+7,0),0)","v":0}]
["Podpis Kapitana",null,{"$f":"SUM(C52:C56)","v":6923},{"$f":"SUM(D52:D56)","v":69},{"$f":"SUM(E52:E56)","v":16},{"$f":"SUM(F52:F56)","v":2210},{"$f":"SUM(G52:G56)","v":25},{"$f":"SUM(H52:H56)","v":5},{"$f":"SUM(I52:I56)","v":2915},{"$f":"SUM(J52:J56)","v":26},{"$f":"SUM(K52:K56)","v":5},{"$f":"SUM(L52:L56)","v":1798},{"$f":"SUM(M52:M56)","v":18},{"$f":"SUM(N52:N56)","v":6}]
[]
["Drużyna",null,"RAZEM",null,null,"I SERIA",null,null,"II SERIA",null,null,"III SERIA"]
["KS KRAJNA Złotów ",null,"m.p","w","p","m.p","w","p","m.p","w","p","m.p","w","p"]
[9,{"$f":"_xlfn.IFNA(VLOOKUP(A61,Indywidualna[],2,0),0)","v":"Biniakiewicz Marian"},{"$f":"F61+I61+L61","v":1997},{"$f":"G61+J61+M61","v":23},{"$f":"H61+K61+N61","v":7},{"$f":"_xlfn.IFNA(VLOOKUP($A61,Indywidualna[],COLUMNS($F60:F60)+7,0),0)","v":344},{"$f":"_xlfn.IFNA(VLOOKUP($A61,Indywidualna[],COLUMNS($F60:G60)+7,0),0)","v":6},{"$f":"_xlfn.IFNA(VLOOKUP($A61,Indywidualna[],COLUMNS($F60:H60)+7,0),0)","v":3},{"$f":"_xlfn.IFNA(VLOOKUP($A61,Indywidualna[],COLUMNS($F60:I60)+7,0),0)","v":1436},{"$f":"_xlfn.IFNA(VLOOKUP($A61,Indywidualna[],COLUMNS($F60:J60)+7,0),0)","v":14},{"$f":"_xlfn.IFNA(VLOOKUP($A61,Indywidualna[],COLUMNS($F60:K60)+7,0),0)","v":1},{"$f":"_xlfn.IFNA(VLOOKUP($A61,Indywidualna[],COLUMNS($F60:L60)+7,0),0)","v":217},{"$f":"_xlfn.IFNA(VLOOKUP($A61,Indywidualna[],COLUMNS($F60:M60)+7,0),0)","v":3},{"$f":"_xlfn.IFNA(VLOOKUP($A61,Indywidualna[],COLUMNS($F60:N60)+7,0),0)","v":3}]
[10,{"$f":"_xlfn.IFNA(VLOOKUP(A62,Indywidualna[],2,0),0)","v":"Siemaszko Henryk"},{"$f":"F62+I62+L62","v":3434},{"$f":"G62+J62+M62","v":33},{"$f":"H62+K62+N62","v":1},{"$f":"_xlfn.IFNA(VLOOKUP($A62,Indywidualna[],COLUMNS($F61:F61)+7,0),0)","v":1229},{"$f":"_xlfn.IFNA(VLOOKUP($A62,Indywidualna[],COLUMNS($F61:G61)+7,0),0)","v":13},{"$f":"_xlfn.IFNA(VLOOKUP($A62,Indywidualna[],COLUMNS($F61:H61)+7,0),0)","v":1},{"$f":"_xlfn.IFNA(VLOOKUP($A62,Indywidualna[],COLUMNS($F61:I61)+7,0),0)","v":1138},{"$f":"_xlfn.IFNA(VLOOKUP($A62,Indywidualna[],COLUMNS($F61:J61)+7,0),0)","v":11},{"$f":"_xlfn.IFNA(VLOOKUP($A62,Indywidualna[],COLUMNS($F61:K61)+7,0),0)","v":0},{"$f":"_xlfn.IFNA(VLOOKUP($A62,Indywidualna[],COLUMNS($F61:L61)+7,0),0)","v":1067},{"$f":"_xlfn.IFNA(VLOOKUP($A62,Indywidualna[],COLUMNS($F61:M61)+7,0),0)","v":9},{"$f":"_xlfn.IFNA(VLOOKUP($A62,Indywidualna[],COLUMNS($F61:N61)+7,0),0)","v":0}]
[11,{"$f":"_xlfn.IFNA(VLOOKUP(A63,Indywidualna[],2,0),0)","v":"Szatkowski Leszek"},{"$f":"F63+I63+L63","v":2514},{"$f":"G63+J63+M63","v":29},{"$f":"H63+K63+N63","v":8},{"$f":"_xlfn.IFNA(VLOOKUP($A63,Indywidualna[],COLUMNS($F62:F62)+7,0),0)","v":1279},{"$f":"_xlfn.IFNA(VLOOKUP($A63,Indywidualna[],COLUMNS($F62:G62)+7,0),0)","v":13},{"$f":"_xlfn.IFNA(VLOOKUP($A63,Indywidualna[],COLUMNS($F62:H62)+7,0),0)","v":1},{"$f":"_xlfn.IFNA(VLOOKUP($A63,Indywidualna[],COLUMNS($F62:I62)+7,0),0)","v":60},{"$f":"_xlfn.IFNA(VLOOKUP($A63,Indywidualna[],COLUMNS($F62:J62)+7,0),0)","v":5},{"$f":"_xlfn.IFNA(VLOOKUP($A63,Indywidualna[],COLUMNS($F62:K62)+7,0),0)","v":5},{"$f":"_xlfn.IFNA(VLOOKUP($A63,Indywidualna[],COLUMNS($F62:L62)+7,0),0)","v":1175},{"$f":"_xlfn.IFNA(VLOOKUP($A63,Indywidualna[],COLUMNS($F62:M62)+7,0),0)","v":11},{"$f":"_xlfn.IFNA(VLOOKUP($A63,Indywidualna[],COLUMNS($F62:N62)+7,0),0)","v":2}]
[12,{"$f":"_xlfn.IFNA(VLOOKUP(A64,Indywidualna[],2,0),0)","v":"Bianga Edward"},{"$f":"F64+I64+L64","v":1117},{"$f":"G64+J64+M64","v":16},{"$f":"H64+K64+N64","v":5},{"$f":"_xlfn.IFNA(VLOOKUP($A64,Indywidualna[],COLUMNS($F63:F63)+7,0),0)","v":587},{"$f":"_xlfn.IFNA(VLOOKUP($A64,Indywidualna[],COLUMNS($F63:G63)+7,0),0)","v":7},{"$f":"_xlfn.IFNA(VLOOKUP($A64,Indywidualna[],COLUMNS($F63:H63)+7,0),0)","v":1},{"$f":"_xlfn.IFNA(VLOOKUP($A64,Indywidualna[],COLUMNS($F63:I63)+7,0),0)","v":771},{"$f":"_xlfn.IFNA(VLOOKUP($A64,Indywidualna[],COLUMNS($F63:J63)+7,0),0)","v":7},{"$f":"_xlfn.IFNA(VLOOKUP($A64,Indywidualna[],COLUMNS($F63:K63)+7,0),0)","v":0},{"$f":"_xlfn.IFNA(VLOOKUP($A64,Indywidualna[],COLUMNS($F63:L63)+7,0),0)","v":-241},{"$f":"_xlfn.IFNA(VLOOKUP($A64,Indywidualna[],COLUMNS($F63:M63)+7,0),0)","v":2},{"$f":"_xlfn.IFNA(VLOOKUP($A64,Indywidualna[],COLUMNS($F63:N63)+7,0),0)","v":4}]
[null,{"$f":"_xlfn.IFNA(VLOOKUP(A65,Indywidualna[],2,0),0)","v":0},{"$f":"F65+I65+L65","v":0},{"$f":"G65+J65+M65","v":0},{"$f":"H65+K65+N65","v":0},{"$f":"_xlfn.IFNA(VLOOKUP($A65,Indywidualna[],COLUMNS($F64:F64)+7,0),0)","v":0},{"$f":"_xlfn.IFNA(VLOOKUP($A65,Indywidualna[],COLUMNS($F64:G64)+7,0),0)","v":0},{"$f":"_xlfn.IFNA(VLOOKUP($A65,Indywidualna[],COLUMNS($F64:H64)+7,0),0)","v":0},{"$f":"_xlfn.IFNA(VLOOKUP($A65,Indywidualna[],COLUMNS($F64:I64)+7,0),0)","v":0},{"$f":"_xlfn.IFNA(VLOOKUP($A65,Indywidualna[],COLUMNS($F64:J64)+7,0),0)","v":0},{"$f":"_xlfn.IFNA(VLOOKUP($A65,Indywidualna[],COLUMNS($F64:K64)+7,0),0)","v":0},{"$f":"_xlfn.IFNA(VLOOKUP($A65,Indywidualna[],COLUMNS($F64:L64)+7,0),0)","v":0},{"$f":"_xlfn.IFNA(VLOOKUP($A65,Indywidualna[],COLUMNS($F64:M64)+7,0),0)","v":0},{"$f":"_xlfn.IFNA(VLOOKUP($A65,Indywidualna[],COLUMNS($F64:N64)+7,0),0)","v":0}]
["Podpis Kapitana",null,{"$f":"SUM(C61:C65)","v":9062},{"$f":"SUM(D61:D65)","v":101},{"$f":"SUM(E61:E65)","v":21},{"$f":"SUM(F61:F65)","v":3439},{"$f":"SUM(G61:G65)","v":39},{"$f":"SUM(H61:H65)","v":6},{"$f":"SUM(I61:I65)","v":3405},{"$f":"SUM(J61:J65)","v":37},{"$f":"SUM(K61:K65)","v":6},{"$f":"SUM(L61:L65)","v":2218},{"$f":"SUM(M61:M65)","v":25},{"$f":"SUM(N61:N65)","v":9}]
[]
["Drużyna",null,"RAZEM",null,null,"I SERIA",null,null,"II SERIA",null,null,"III SERIA"]
["GOKSiR Lipusz",null,"m.p","w","p","m.p","w","p","m.p","w","p","m.p","w","p"]
[null,{"$f":"_xlfn.IFNA(VLOOKUP(A70,Indywidualna[],2,0),0)","v":0},{"$f":"F70+I70+L70","v":0},{"$f":"G70+J70+M70","v":0},{"$f":"H70+K70+N70","v":0},{"$f":"_xlfn.IFNA(VLOOKUP($A70,Indywidualna[],COLUMNS($F69:F69)+7,0),0)","v":0},{"$f":"_xlfn.IFNA(VLOOKUP($A70,Indywidualna[],COLUMNS($F69:G69)+7,0),0)","v":0},{"$f":"_xlfn.IFNA(VLOOKUP($A70,Indywidualna[],COLUMNS($F69:H69)+7,0),0)","v":0},{"$f":"_xlfn.IFNA(VLOOKUP($A70,Indywidualna[],COLUMNS($F69:I69)+7,0),0)","v":0},{"$f":"_xlfn.IFNA(VLOOKUP($A70,Indywidualna[],COLUMNS($F69:J69)+7,0),0)","v":0},{"$f":"_xlfn.IFNA(VLOOKUP($A70,Indywidualna[],COLUMNS($F69:K69)+7,0),0)","v":0},{"$f":"_xlfn.IFNA(VLOOKUP($A70,Indywidualna[],COLUMNS($F69:L69)+7,0),0)","v":0},{"$f":"_xlfn.IFNA(VLOOKUP($A70,Indywidualna[],COLUMNS($F69:M69)+7,0),0)","v":0},{"$f":"_xlfn.IFNA(VLOOKUP($A70,Indywidualna[],COLUMNS($F69:N69)+7,0),0)","v":0}]
[null,{"$f":"_xlfn.IFNA(VLOOKUP(A71,Indywidualna[],2,0),0)","v":0},{"$f":"F71+I71+L71","v":0},{"$f":"G71+J71+M71","v":0},{"$f":"H71+K71+N71","v":0},{"$f":"_xlfn.IFNA(VLOOKUP($A71,Indywidualna[],COLUMNS($F70:F70)+7,0),0)","v":0},{"$f":"_xlfn.IFNA(VLOOKUP($A71,Indywidualna[],COLUMNS($F70:G70)+7,0),0)","v":0},{"$f":"_xlfn.IFNA(VLOOKUP($A71,Indywidualna[],COLUMNS($F70:H70)+7,0),0)","v":0},{"$f":"_xlfn.IFNA(VLOOKUP($A71,Indywidualna[],COLUMNS($F70:I70)+7,0),0)","v":0},{"$f":"_xlfn.IFNA(VLOOKUP($A71,Indywidualna[],COLUMNS($F70:J70)+7,0),0)","v":0},{"$f":"_xlfn.IFNA(VLOOKUP($A71,Indywidualna[],COLUMNS($F70:K70)+7,0),0)","v":0},{"$f":"_xlfn.IFNA(VLOOKUP($A71,Indywidualna[],COLUMNS($F70:L70)+7,0),0)","v":0},{"$f":"_xlfn.IFNA(VLOOKUP($A71,Indywidualna[],COLUMNS($F70:M70)+7,0),0)","v":0},{"$f":"_xlfn.IFNA(VLOOKUP($A71,Indywidualna[],COLUMNS($F70:N70)+7,0),0)","v":0}]
[null,{"$f":"_xlfn.IFNA(VLOOKUP(A72,Indywidualna[],2,0),0)","v":0},{"$f":"F72+I72+L72","v":0},{"$f":"G72+J72+M72","v":0},{"$f":"H72+K72+N72","v":0},{"$f":"_xlfn.IFNA(VLOOKUP($A72,Indywidualna[],COLUMNS($F71:F71)+7,0),0)","v":0},{"$f":"_xlfn.IFNA(VLOOKUP($A72,Indywidualna[],COLUMNS($F71:G71)+7,0),0)","v":0},{"$f":"_xlfn.IFNA(VLOOKUP($A72,Indywidualna[],COLUMNS($F71:H71)+7,0),0)","v":0},{"$f":"_xlfn.IFNA(VLOOKUP($A72,Indywidualna[],COLUMNS($F71:I71)+7,0),0)","v":0},{"$f":"_xlfn.IFNA(VLOOKUP($A72,Indywidualna[],COLUMNS($F71:J71)+7,0),0)","v":0},{"$f":"_xlfn.IFNA(VLOOKUP($A72,Indywidualna[],COLUMNS($F71:K71)+7,0),0)","v":0},{"$f":"_xlfn.IFNA(VLOOKUP($A72,Indywidualna[],COLUMNS($F71:L71)+7,0),0)","v":0},{"$f":"_xlfn.IFNA(VLOOKUP($A72,Indywidualna[],COLUMNS($F71:M71)+7,0),0)","v":0},{"$f":"_xlfn.IFNA(VLOOKUP($A72,Indywidualna[],COLUMNS($F71:N71)+7,0),0)","v":0}]
[null,{"$f":"_xlfn.IFNA(VLOOKUP(A73,Indywidualna[],2,0),0)","v":0},{"$f":"F73+I73+L73","v":0},{"$f":"G73+J73+M73","v":0},{"$f":"H73+K73+N73","v":0},{"$f":"_xlfn.IFNA(VLOOKUP($A73,Indywidualna[],COLUMNS($F72:F72)+7,0),0)","v":0},{"$f":"_xlfn.IFNA(VLOOKUP($A73,Indywidualna[],COLUMNS($F72:G72)+7,0),0)","v":0},{"$f":"_xlfn.IFNA(VLOOKUP($A73,Indywidualna[],COLUMNS($F72:H72)+7,0),0)","v":0},{"$f":"_xlfn.IFNA(VLOOKUP($A73,Indywidualna[],COLUMNS($F72:I72)+7,0),0)","v":0},{"$f":"_xlfn.IFNA(VLOOKUP($A73,Indywidualna[],COLUMNS($F72:J72)+7,0),0)","v":0},{"$f":"_xlfn.IFNA(VLOOKUP($A73,Indywidualna[],COLUMNS($F72:K72)+7,0),0)","v":0},{"$f":"_xlfn.IFNA(VLOOKUP($A73,Indywidualna[],COLUMNS($F72:L72)+7,0),0)","v":0},{"$f":"_xlfn.IFNA(VLOOKUP($A73,Indywidualna[],COLUMNS($F72:M72)+7,0),0)","v":0},{"$f":"_xlfn.IFNA(VLOOKUP($A73,Indywidualna[],COLUMNS($F72:N72)+7,0),0)","v":0}]
[null,{"$f":"_xlfn.IFNA(VLOOKUP(A74,Indywidualna[],2,0),0)","v":0},{"$f":"F74+I74+L74","v":0},{"$f":"G74+J74+M74","v":0},{"$f":"H74+K74+N74","v":0},{"$f":"_xlfn.IFNA(VLOOKUP($A74,Indywidualna[],COLUMNS($F73:F73)+7,0),0)","v":0},{"$f":"_xlfn.IFNA(VLOOKUP($A74,Indywidualna[],COLUMNS($F73:G73)+7,0),0)","v":0},{"$f":"_xlfn.IFNA(VLOOKUP($A74,Indywidualna[],COLUMNS($F73:H73)+7,0),0)","v":0},{"$f":"_xlfn.IFNA(VLOOKUP($A74,Indywidualna[],COLUMNS($F73:I73)+7,0),0)","v":0},{"$f":"_xlfn.IFNA(VLOOKUP($A74,Indywidualna[],COLUMNS($F73:J73)+7,0),0)","v":0},{"$f":"_xlfn.IFNA(VLOOKUP($A74,Indywidualna[],COLUMNS($F73:K73)+7,0),0)","v":0},{"$f":"_xlfn.IFNA(VLOOKUP($A74,Indywidualna[],COLUMNS($F73:L73)+7,0),0)","v":0},{"$f":"_xlfn.IFNA(VLOOKUP($A74,Indywidualna[],COLUMNS($F73:M73)+7,0),0)","v":0},{"$f":"_xlfn.IFNA(VLOOKUP($A74,Indywidualna[],COLUMNS($F73:N73)+7,0),0)","v":0}]
["Podpis Kapitana",null,{"$f":"SUM(C70:C74)","v":0},{"$f":"SUM(D70:D74)","v":0},{"$f":"SUM(E70:E74)","v":0},{"$f":"SUM(F70:F74)","v":0},{"$f":"SUM(G70:G74)","v":0},{"$f":"SUM(H70:H74)","v":0},{"$f":"SUM(I70:I74)","v":0},{"$f":"SUM(J70:J74)","v":0},{"$f":"SUM(K70:K74)","v":0},{"$f":"SUM(L70:L74)","v":0},{"$f":"SUM(M70:M74)","v":0},{"$f":"SUM(N70:N74)","v":0}]
[]
["Drużyna",null,"RAZEM",null,null,"I SERIA",null,null,"II SERIA",null,null,"III SERIA"]
[null,null,"m.p","w","p","m.p","w","p","m.p","w","p","m.p","w","p"]
[null,{"$f":"_xlfn.IFNA(VLOOKUP(A79,Indywidualna[],2,0),0)","v":0},{"$f":"I79+L79","v":0},{"$f":"J79+M79","v":0},{"$f":"K79+N79","v":0},{"$f":"_xlfn.IFNA(VLOOKUP($A79,Indywidualna[],COLUMNS($F78:F78)+7,0),0)","v":0},{"$f":"_xlfn.IFNA(VLOOKUP($A79,Indywidualna[],COLUMNS($F78:G78)+7,0),0)","v":0},{"$f":"_xlfn.IFNA(VLOOKUP($A79,Indywidualna[],COLUMNS($F78:H78)+7,0),0)","v":0},{"$f":"_xlfn.IFNA(VLOOKUP($A79,Indywidualna[],COLUMNS($F78:I78)+7,0),0)","v":0},{"$f":"_xlfn.IFNA(VLOOKUP($A79,Indywidualna[],COLUMNS($F78:J78)+7,0),0)","v":0},{"$f":"_xlfn.IFNA(VLOOKUP($A79,Indywidualna[],COLUMNS($F78:K78)+7,0),0)","v":0},{"$f":"_xlfn.IFNA(VLOOKUP($A79,Indywidualna[],COLUMNS($F78:L78)+7,0),0)","v":0},{"$f":"_xlfn.IFNA(VLOOKUP($A79,Indywidualna[],COLUMNS($F78:M78)+7,0),0)","v":0},{"$f":"_xlfn.IFNA(VLOOKUP($A79,Indywidualna[],COLUMNS($F78:N78)+7,0),0)","v":0}]
[null,{"$f":"_xlfn.IFNA(VLOOKUP(A80,Indywidualna[],2,0),0)","v":0},{"$f":"I80+L80","v":0},{"$f":"J80+M80","v":0},{"$f":"K80+N80","v":0},{"$f":"_xlfn.IFNA(VLOOKUP($A80,Indywidualna[],COLUMNS($F79:F79)+7,0),0)","v":0},{"$f":"_xlfn.IFNA(VLOOKUP($A80,Indywidualna[],COLUMNS($F79:G79)+7,0),0)","v":0},{"$f":"_xlfn.IFNA(VLOOKUP($A80,Indywidualna[],COLUMNS($F79:H79)+7,0),0)","v":0},{"$f":"_xlfn.IFNA(VLOOKUP($A80,Indywidualna[],COLUMNS($F79:I79)+7,0),0)","v":0},{"$f":"_xlfn.IFNA(VLOOKUP($A80,Indywidualna[],COLUMNS($F79:J79)+7,0),0)","v":0},{"$f":"_xlfn.IFNA(VLOOKUP($A80,Indywidualna[],COLUMNS($F79:K79)+7,0),0)","v":0},{"$f":"_xlfn.IFNA(VLOOKUP($A80,Indywidualna[],COLUMNS($F79:L79)+7,0),0)","v":0},{"$f":"_xlfn.IFNA(VLOOKUP($A80,Indywidualna[],COLUMNS($F79:M79)+7,0),0)","v":0},{"$f":"_xlfn.IFNA(VLOOKUP($A80,Indywidualna[],COLUMNS($F79:N79)+7,0),0)","v":0}]
[null,{"$f":"_xlfn.IFNA(VLOOKUP(A81,Indywidualna[],2,0),0)","v":0},{"$f":"I81+L81","v":0},{"$f":"J81+M81","v":0},{"$f":"K81+N81","v":0},{"$f":"_xlfn.IFNA(VLOOKUP($A81,Indywidualna[],COLUMNS($F80:F80)+7,0),0)","v":0},{"$f":"_xlfn.IFNA(VLOOKUP($A81,Indywidualna[],COLUMNS($F80:G80)+7,0),0)","v":0},{"$f":"_xlfn.IFNA(VLOOKUP($A81,Indywidualna[],COLUMNS($F80:H80)+7,0),0)","v":0},{"$f":"_xlfn.IFNA(VLOOKUP($A81,Indywidualna[],COLUMNS($F80:I80)+7,0),0)","v":0},{"$f":"_xlfn.IFNA(VLOOKUP($A81,Indywidualna[],COLUMNS($F80:J80)+7,0),0)","v":0},{"$f":"_xlfn.IFNA(VLOOKUP($A81,Indywidualna[],COLUMNS($F80:K80)+7,0),0)","v":0},{"$f":"_xlfn.IFNA(VLOOKUP($A81,Indywidualna[],COLUMNS($F80:L80)+7,0),0)","v":0},{"$f":"_xlfn.IFNA(VLOOKUP($A81,Indywidualna[],COLUMNS($F80:M80)+7,0),0)","v":0},{"$f":"_xlfn.IFNA(VLOOKUP($A81,Indywidualna[],COLUMNS($F80:N80)+7,0),0)","v":0}]
[null,{"$f":"_xlfn.IFNA(VLOOKUP(A82,Indywidualna[],2,0),0)","v":0},{"$f":"I82+L82","v":0},{"$f":"J82+M82","v":0},{"$f":"K82+N82","v":0},{"$f":"_xlfn.IFNA(VLOOKUP($A82,Indywidualna[],COLUMNS($F81:F81)+7,0),0)","v":0},{"$f":"_xlfn.IFNA(VLOOKUP($A82,Indywidualna[],COLUMNS($F81:G81)+7,0),0)","v":0},{"$f":"_xlfn.IFNA(VLOOKUP($A82,Indywidualna[],COLUMNS($F81:H81)+7,0),0)","v":0},{"$f":"_xlfn.IFNA(VLOOKUP($A82,Indywidualna[],COLUMNS($F81:I81)+7,0),0)","v":0},{"$f":"_xlfn.IFNA(VLOOKUP($A82,Indywidualna[],COLUMNS($F81:J81)+7,0),0)","v":0},{"$f":"_xlfn.IFNA(VLOOKUP($A82,Indywidualna[],COLUMNS($F81:K81)+7,0),0)","v":0},{"$f":"_xlfn.IFNA(VLOOKUP($A82,Indywidualna[],COLUMNS($F81:L81)+7,0),0)","v":0},{"$f":"_xlfn.IFNA(VLOOKUP($A82,Indywidualna[],COLUMNS($F81:M81)+7,0),0)","v":0},{"$f":"_xlfn.IFNA(VLOOKUP($A82,Indywidualna[],COLUMNS($F81:N81)+7,0),0)","v":0}]
[null,{"$f":"_xlfn.IFNA(VLOOKUP(A83,Indywidualna[],2,0),0)","v":0},{"$f":"I83+L83","v":0},{"$f":"J83+M83","v":0},{"$f":"K83+N83","v":0},{"$f":"_xlfn.IFNA(VLOOKUP($A83,Indywidualna[],COLUMNS($F82:F82)+7,0),0)","v":0},{"$f":"_xlfn.IFNA(VLOOKUP($A83,Indywidualna[],COLUMNS($F82:G82)+7,0),0)","v":0},{"$f":"_xlfn.IFNA(VLOOKUP($A83,Indywidualna[],COLUMNS($F82:H82)+7,0),0)","v":0},{"$f":"_xlfn.IFNA(VLOOKUP($A83,Indywidualna[],COLUMNS($F82:I82)+7,0),0)","v":0},{"$f":"_xlfn.IFNA(VLOOKUP($A83,Indywidualna[],COLUMNS($F82:J82)+7,0),0)","v":0},{"$f":"_xlfn.IFNA(VLOOKUP($A83,Indywidualna[],COLUMNS($F82:K82)+7,0),0)","v":0},{"$f":"_xlfn.IFNA(VLOOKUP($A83,Indywidualna[],COLUMNS($F82:L82)+7,0),0)","v":0},{"$f":"_xlfn.IFNA(VLOOKUP($A83,Indywidualna[],COLUMNS($F82:M82)+7,0),0)","v":0},{"$f":"_xlfn.IFNA(VLOOKUP($A83,Indywidualna[],COLUMNS($F82:N82)+7,0),0)","v":0}]
["Podpis Kapitana",null,{"$f":"SUM(C79:C83)","v":0},{"$f":"SUM(D79:D83)","v":0},{"$f":"SUM(E79:E83)","v":0},{"$f":"SUM(F79:F83)","v":0},{"$f":"SUM(G79:G83)","v":0},{"$f":"SUM(H79:H83)","v":0},{"$f":"SUM(I79:I83)","v":0},{"$f":"SUM(J79:J83)","v":0},{"$f":"SUM(K79:K83)","v":0},{"$f":"SUM(L79:L83)","v":0},{"$f":"SUM(M79:M83)","v":0},{"$f":"SUM(N79:N83)","v":0}]
[]
["Drużyna",null,"RAZEM",null,null,"I SERIA",null,null,"II SERIA",null,null,"III SERIA"]
[null,null,"m.p","w","p","m.p","w","p","m.p","w","p","m.p","w","p"]
[null,{"$f":"_xlfn.IFNA(VLOOKUP(A88,Indywidualna[],2,0),0)","v":0},{"$f":"I88+L88","v":0},{"$f":"J88+M88","v":0},{"$f":"K88+N88","v":0},{"$f":"_xlfn.IFNA(VLOOKUP($A88,Indywidualna[],COLUMNS($F87:F87)+7,0),0)","v":0},{"$f":"_xlfn.IFNA(VLOOKUP($A88,Indywidualna[],COLUMNS($F87:G87)+7,0),0)","v":0},{"$f":"_xlfn.IFNA(VLOOKUP($A88,Indywidualna[],COLUMNS($F87:H87)+7,0),0)","v":0},{"$f":"_xlfn.IFNA(VLOOKUP($A88,Indywidualna[],COLUMNS($F87:I87)+7,0),0)","v":0},{"$f":"_xlfn.IFNA(VLOOKUP($A88,Indywidualna[],COLUMNS($F87:J87)+7,0),0)","v":0},{"$f":"_xlfn.IFNA(VLOOKUP($A88,Indywidualna[],COLUMNS($F87:K87)+7,0),0)","v":0},{"$f":"_xlfn.IFNA(VLOOKUP($A88,Indywidualna[],COLUMNS($F87:L87)+7,0),0)","v":0},{"$f":"_xlfn.IFNA(VLOOKUP($A88,Indywidualna[],COLUMNS($F87:M87)+7,0),0)","v":0},{"$f":"_xlfn.IFNA(VLOOKUP($A88,Indywidualna[],COLUMNS($F87:N87)+7,0),0)","v":0}]
[null,{"$f":"_xlfn.IFNA(VLOOKUP(A89,Indywidualna[],2,0),0)","v":0},{"$f":"I89+L89","v":0},{"$f":"J89+M89","v":0},{"$f":"K89+N89","v":0},{"$f":"_xlfn.IFNA(VLOOKUP($A89,Indywidualna[],COLUMNS($F88:F88)+7,0),0)","v":0},{"$f":"_xlfn.IFNA(VLOOKUP($A89,Indywidualna[],COLUMNS($F88:G88)+7,0),0)","v":0},{"$f":"_xlfn.IFNA(VLOOKUP($A89,Indywidualna[],COLUMNS($F88:H88)+7,0),0)","v":0},{"$f":"_xlfn.IFNA(VLOOKUP($A89,Indywidualna[],COLUMNS($F88:I88)+7,0),0)","v":0},{"$f":"_xlfn.IFNA(VLOOKUP($A89,Indywidualna[],COLUMNS($F88:J88)+7,0),0)","v":0},{"$f":"_xlfn.IFNA(VLOOKUP($A89,Indywidualna[],COLUMNS($F88:K88)+7,0),0)","v":0},{"$f":"_xlfn.IFNA(VLOOKUP($A89,Indywidualna[],COLUMNS($F88:L88)+7,0),0)","v":0},{"$f":"_xlfn.IFNA(VLOOKUP($A89,Indywidualna[],COLUMNS($F88:M88)+7,0),0)","v":0},{"$f":"_xlfn.IFNA(VLOOKUP($A89,Indywidualna[],COLUMNS($F88:N88)+7,0),0)","v":0}]
[null,{"$f":"_xlfn.IFNA(VLOOKUP(A90,Indywidualna[],2,0),0)","v":0},{"$f":"I90+L90","v":0},{"$f":"J90+M90","v":0},{"$f":"K90+N90","v":0},{"$f":"_xlfn.IFNA(VLOOKUP($A90,Indywidualna[],COLUMNS($F89:F89)+7,0),0)","v":0},{"$f":"_xlfn.IFNA(VLOOKUP($A90,Indywidualna[],COLUMNS($F89:G89)+7,0),0)","v":0},{"$f":"_xlfn.IFNA(VLOOKUP($A90,Indywidualna[],COLUMNS($F89:H89)+7,0),0)","v":0},{"$f":"_xlfn.IFNA(VLOOKUP($A90,Indywidualna[],COLUMNS($F89:I89)+7,0),0)","v":0},{"$f":"_xlfn.IFNA(VLOOKUP($A90,Indywidualna[],COLUMNS($F89:J89)+7,0),0)","v":0},{"$f":"_xlfn.IFNA(VLOOKUP($A90,Indywidualna[],COLUMNS($F89:K89)+7,0),0)","v":0},{"$f":"_xlfn.IFNA(VLOOKUP($A90,Indywidualna[],COLUMNS($F89:L89)+7,0),0)","v":0},{"$f":"_xlfn.IFNA(VLOOKUP($A90,Indywidualna[],COLUMNS($F89:M89)+7,0),0)","v":0},{"$f":"_xlfn.IFNA(VLOOKUP($A90,Indywidualna[],COLUMNS($F89:N89)+7,0),0)","v":0}]
[null,{"$f":"_xlfn.IFNA(VLOOKUP(A91,Indywidualna[],2,0),0)","v":0},{"$f":"I91+L91","v":0},{"$f":"J91+M91","v":0},{"$f":"K91+N91","v":0},{"$f":"_xlfn.IFNA(VLOOKUP($A91,Indywidualna[],COLUMNS($F90:F90)+7,0),0)","v":0},{"$f":"_xlfn.IFNA(VLOOKUP($A91,Indywidualna[],COLUMNS($F90:G90)+7,0),0)","v":0},{"$f":"_xlfn.IFNA(VLOOKUP($A91,Indywidualna[],COLUMNS($F90:H90)+7,0),0)","v":0},{"$f":"_xlfn.IFNA(VLOOKUP($A91,Indywidualna[],COLUMNS($F90:I90)+7,0),0)","v":0},{"$f":"_xlfn.IFNA(VLOOKUP($A91,Indywidualna[],COLUMNS($F90:J90)+7,0),0)","v":0},{"$f":"_xlfn.IFNA(VLOOKUP($A91,Indywidualna[],COLUMNS($F90:K90)+7,0),0)","v":0},{"$f":"_xlfn.IFNA(VLOOKUP($A91,Indywidualna[],COLUMNS($F90:L90)+7,0),0)","v":0},{"$f":"_xlfn.IFNA(VLOOKUP($A91,Indywidualna[],COLUMNS($F90:M90)+7,0),0)","v":0},{"$f":"_xlfn.IFNA(VLOOKUP($A91,Indywidualna[],COLUMNS($F90:N90)+7,0),0)","v":0}]
[null,{"$f":"_xlfn.IFNA(VLOOKUP(A92,Indywidualna[],2,0),0)","v":0},{"$f":"I92+L92","v":0},{"$f":"J92+M92","v":0},{"$f":"K92+N92","v":0},{"$f":"_xlfn.IFNA(VLOOKUP($A92,Indywidualna[],COLUMNS($F91:F91)+7,0),0)","v":0},{"$f":"_xlfn.IFNA(VLOOKUP($A92,Indywidualna[],COLUMNS($F91:G91)+7,0),0)","v":0},{"$f":"_xlfn.IFNA(VLOOKUP($A92,Indywidualna[],COLUMNS($F91:H91)+7,0),0)","v":0},{"$f":"_xlfn.IFNA(VLOOKUP($A92,Indywidualna[],COLUMNS($F91:I91)+7,0),0)","v":0},{"$f":"_xlfn.IFNA(VLOOKUP($A92,Indywidualna[],COLUMNS($F91:J91)+7,0),0)","v":0},{"$f":"_xlfn.IFNA(VLOOKUP($A92,Indywidualna[],COLUMNS($F91:K91)+7,0),0)","v":0},{"$f":"_xlfn.IFNA(VLOOKUP($A92,Indywidualna[],COLUMNS($F91:L91)+7,0),0)","v":0},{"$f":"_xlfn.IFNA(VLOOKUP($A92,Indywidualna[],COLUMNS($F91:M91)+7,0),0)","v":0},{"$f":"_xlfn.IFNA(VLOOKUP($A92,Indywidualna[],COLUMNS($F91:N91)+7,0),0)","v":0}]
["Podpis Kapitana",null,{"$f":"SUM(C88:C92)","v":0},{"$f":"SUM(D88:D92)","v":0},{"$f":"SUM(E88:E92)","v":0},{"$f":"SUM(F88:F92)","v":0},{"$f":"SUM(G88:G92)","v":0},{"$f":"SUM(H88:H92)","v":0},{"$f":"SUM(I88:I92)","v":0},{"$f":"SUM(J88:J92)","v":0},{"$f":"SUM(K88:K92)","v":0},{"$f":"SUM(L88:L92)","v":0},{"$f":"SUM(M88:M92)","v":0},{"$f":"SUM(N88:N92)","v":0}]
[]
["Drużyna",null,"RAZEM",null,null,"I SERIA",null,null,"II SERIA",null,null,"III SERIA"]
[null,null,"m.p","w","p","m.p","w","p","m.p","w","p","m.p","w","p"]
[null,{"$f":"_xlfn.IFNA(VLOOKUP(A97,Indywidualna[],2,0),0)","v":0},{"$f":"I97+L97","v":0},{"$f":"J97+M97","v":0},{"$f":"K97+N97","v":0},{"$f":"_xlfn.IFNA(VLOOKUP($A97,Indywidualna[],COLUMNS($F96:F96)+7,0),0)","v":0},{"$f":"_xlfn.IFNA(VLOOKUP($A97,Indywidualna[],COLUMNS($F96:G96)+7,0),0)","v":0},{"$f":"_xlfn.IFNA(VLOOKUP($A97,Indywidualna[],COLUMNS($F96:H96)+7,0),0)","v":0},{"$f":"_xlfn.IFNA(VLOOKUP($A97,Indywidualna[],COLUMNS($F96:I96)+7,0),0)","v":0},{"$f":"_xlfn.IFNA(VLOOKUP($A97,Indywidualna[],COLUMNS($F96:J96)+7,0),0)","v":0},{"$f":"_xlfn.IFNA(VLOOKUP($A97,Indywidualna[],COLUMNS($F96:K96)+7,0),0)","v":0},{"$f":"_xlfn.IFNA(VLOOKUP($A97,Indywidualna[],COLUMNS($F96:L96)+7,0),0)","v":0},{"$f":"_xlfn.IFNA(VLOOKUP($A97,Indywidualna[],COLUMNS($F96:M96)+7,0),0)","v":0},{"$f":"_xlfn.IFNA(VLOOKUP($A97,Indywidualna[],COLUMNS($F96:N96)+7,0),0)","v":0}]
[null,{"$f":"_xlfn.IFNA(VLOOKUP(A98,Indywidualna[],2,0),0)","v":0},{"$f":"I98+L98","v":0},{"$f":"J98+M98","v":0},{"$f":"K98+N98","v":0},{"$f":"_xlfn.IFNA(VLOOKUP($A98,Indywidualna[],COLUMNS($F97:F97)+7,0),0)","v":0},{"$f":"_xlfn.IFNA(VLOOKUP($A98,Indywidualna[],COLUMNS($F97:G97)+7,0),0)","v":0},{"$f":"_xlfn.IFNA(VLOOKUP($A98,Indywidualna[],COLUMNS($F97:H97)+7,0),0)","v":0},{"$f":"_xlfn.IFNA(VLOOKUP($A98,Indywidualna[],COLUMNS($F97:I97)+7,0),0)","v":0},{"$f":"_xlfn.IFNA(VLOOKUP($A98,Indywidualna[],COLUMNS($F97:J97)+7,0),0)","v":0},{"$f":"_xlfn.IFNA(VLOOKUP($A98,Indywidualna[],COLUMNS($F97:K97)+7,0),0)","v":0},{"$f":"_xlfn.IFNA(VLOOKUP($A98,Indywidualna[],COLUMNS($F97:L97)+7,0),0)","v":0},{"$f":"_xlfn.IFNA(VLOOKUP($A98,Indywidualna[],COLUMNS($F97:M97)+7,0),0)","v":0},{"$f":"_xlfn.IFNA(VLOOKUP($A98,Indywidualna[],COLUMNS($F97:N97)+7,0),0)","v":0}]
[null,{"$f":"_xlfn.IFNA(VLOOKUP(A99,Indywidualna[],2,0),0)","v":0},{"$f":"I99+L99","v":0},{"$f":"J99+M99","v":0},{"$f":"K99+N99","v":0},{"$f":"_xlfn.IFNA(VLOOKUP($A99,Indywidualna[],COLUMNS($F98:F98)+7,0),0)","v":0},{"$f":"_xlfn.IFNA(VLOOKUP($A99,Indywidualna[],COLUMNS($F98:G98)+7,0),0)","v":0},{"$f":"_xlfn.IFNA(VLOOKUP($A99,Indywidualna[],COLUMNS($F98:H98)+7,0),0)","v":0},{"$f":"_xlfn.IFNA(VLOOKUP($A99,Indywidualna[],COLUMNS($F98:I98)+7,0),0)","v":0},{"$f":"_xlfn.IFNA(VLOOKUP($A99,Indywidualna[],COLUMNS($F98:J98)+7,0),0)","v":0},{"$f":"_xlfn.IFNA(VLOOKUP($A99,Indywidualna[],COLUMNS($F98:K98)+7,0),0)","v":0},{"$f":"_xlfn.IFNA(VLOOKUP($A99,Indywidualna[],COLUMNS($F98:L98)+7,0),0)","v":0},{"$f":"_xlfn.IFNA(VLOOKUP($A99,Indywidualna[],COLUMNS($F98:M98)+7,0),0)","v":0},{"$f":"_xlfn.IFNA(VLOOKUP($A99,Indywidualna[],COLUMNS($F98:N98)+7,0),0)","v":0}]
[null,{"$f":"_xlfn.IFNA(VLOOKUP(A100,Indywidualna[],2,0),0)","v":0},{"$f":"I100+L100","v":0},{"$f":"J100+M100","v":0},{"$f":"K100+N100","v":0},{"$f":"_xlfn.IFNA(VLOOKUP($A100,Indywidualna[],COLUMNS($F99:F99)+7,0),0)","v":0},{"$f":"_xlfn.IFNA(VLOOKUP($A100,Indywidualna[],COLUMNS($F99:G99)+7,0),0)","v":0},{"$f":"_xlfn.IFNA(VLOOKUP($A100,Indywidualna[],COLUMNS($F99:H99)+7,0),0)","v":0},{"$f":"_xlfn.IFNA(VLOOKUP($A100,Indywidualna[],COLUMNS($F99:I99)+7,0),0)","v":0},{"$f":"_xlfn.IFNA(VLOOKUP($A100,Indywidualna[],COLUMNS($F99:J99)+7,0),0)","v":0},{"$f":"_xlfn.IFNA(VLOOKUP($A100,Indywidualna[],COLUMNS($F99:K99)+7,0),0)","v":0},{"$f":"_xlfn.IFNA(VLOOKUP($A100,Indywidualna[],COLUMNS($F99:L99)+7,0),0)","v":0},{"$f":"_xlfn.IFNA(VLOOKUP($A100,Indywidualna[],COLUMNS($F99:M99)+7,0),0)","v":0},{"$f":"_xlfn.IFNA(VLOOKUP($A100,Indywidualna[],COLUMNS($F99:N99)+7,0),0)","v":0}]
[null,{"$f":"_xlfn.IFNA(VLOOKUP(A101,Indywidualna[],2,0),0)","v":0},{"$f":"I101+L101","v":0},{"$f":"J101+M101","v":0},{"$f":"K101+N101","v":0},{"$f":"_xlfn.IFNA(VLOOKUP($A101,Indywidualna[],COLUMNS($F100:F100)+7,0),0)","v":0},{"$f":"_xlfn.IFNA(VLOOKUP($A101,Indywidualna[],COLUMNS($F100:G100)+7,0),0)","v":0},{"$f":"_xlfn.IFNA(VLOOKUP($A101,Indywidualna[],COLUMNS($F100:H100)+7,0),0)","v":0},{"$f":"_xlfn.IFNA(VLOOKUP($A101,Indywidualna[],COLUMNS($F100:I100)+7,0),0)","v":0},{"$f":"_xlfn.IFNA(VLOOKUP($A101,Indywidualna[],COLUMNS($F100:J100)+7,0),0)","v":0},{"$f":"_xlfn.IFNA(VLOOKUP($A101,Indywidualna[],COLUMNS($F100:K100)+7,0),0)","v":0},{"$f":"_xlfn.IFNA(VLOOKUP($A101,Indywidualna[],COLUMNS($F100:L100)+7,0),0)","v":0},{"$f":"_xlfn.IFNA(VLOOKUP($A101,Indywidualna[],COLUMNS($F100:M100)+7,0),0)","v":0},{"$f":"_xlfn.IFNA(VLOOKUP($A101,Indywidualna[],COLUMNS($F100:N100)+7,0),0)","v":0}]
["Podpis Kapitana",null,{"$f":"SUM(C97:C101)","v":0},{"$f":"SUM(D97:D101)","v":0},{"$f":"SUM(E97:E101)","v":0},{"$f":"SUM(F97:F101)","v":0},{"$f":"SUM(G97:G101)","v":0},{"$f":"SUM(H97:H101)","v":0},{"$f":"SUM(I97:I101)","v":0},{"$f":"SUM(J97:J101)","v":0},{"$f":"SUM(K97:K101)","v":0},{"$f":"SUM(L97:L101)","v":0},{"$f":"SUM(M97:M101)","v":0},{"$f":"SUM(N97:N101)","v":0}]
[]
["Drużyna",null,"RAZEM",null,null,"I SERIA",null,null,"II SERIA",null,null,"III SERIA"]
[null,null,"m.p","w","p","m.p","w","p","m.p","w","p","m.p","w","p"]
[null,{"$f":"_xlfn.IFNA(VLOOKUP(A106,Indywidualna[],2,0),0)","v":0},{"$f":"I106+L106","v":0},{"$f":"J106+M106","v":0},{"$f":"K106+N106","v":0},{"$f":"_xlfn.IFNA(VLOOKUP($A106,Indywidualna[],COLUMNS($F105:F105)+7,0),0)","v":0},{"$f":"_xlfn.IFNA(VLOOKUP($A106,Indywidualna[],COLUMNS($F105:G105)+7,0),0)","v":0},{"$f":"_xlfn.IFNA(VLOOKUP($A106,Indywidualna[],COLUMNS($F105:H105)+7,0),0)","v":0},{"$f":"_xlfn.IFNA(VLOOKUP($A106,Indywidualna[],COLUMNS($F105:I105)+7,0),0)","v":0},{"$f":"_xlfn.IFNA(VLOOKUP($A106,Indywidualna[],COLUMNS($F105:J105)+7,0),0)","v":0},{"$f":"_xlfn.IFNA(VLOOKUP($A106,Indywidualna[],COLUMNS($F105:K105)+7,0),0)","v":0},{"$f":"_xlfn.IFNA(VLOOKUP($A106,Indywidualna[],COLUMNS($F105:L105)+7,0),0)","v":0},{"$f":"_xlfn.IFNA(VLOOKUP($A106,Indywidualna[],COLUMNS($F105:M105)+7,0),0)","v":0},{"$f":"_xlfn.IFNA(VLOOKUP($A106,Indywidualna[],COLUMNS($F105:N105)+7,0),0)","v":0}]
[null,{"$f":"_xlfn.IFNA(VLOOKUP(A107,Indywidualna[],2,0),0)","v":0},{"$f":"I107+L107","v":0},{"$f":"J107+M107","v":0},{"$f":"K107+N107","v":0},{"$f":"_xlfn.IFNA(VLOOKUP($A107,Indywidualna[],COLUMNS($F106:F106)+7,0),0)","v":0},{"$f":"_xlfn.IFNA(VLOOKUP($A107,Indywidualna[],COLUMNS($F106:G106)+7,0),0)","v":0},{"$f":"_xlfn.IFNA(VLOOKUP($A107,Indywidualna[],COLUMNS($F106:H106)+7,0),0)","v":0},{"$f":"_xlfn.IFNA(VLOOKUP($A107,Indywidualna[],COLUMNS($F106:I106)+7,0),0)","v":0},{"$f":"_xlfn.IFNA(VLOOKUP($A107,Indywidualna[],COLUMNS($F106:J106)+7,0),0)","v":0},{"$f":"_xlfn.IFNA(VLOOKUP($A107,Indywidualna[],COLUMNS($F106:K106)+7,0),0)","v":0},{"$f":"_xlfn.IFNA(VLOOKUP($A107,Indywidualna[],COLUMNS($F106:L106)+7,0),0)","v":0},{"$f":"_xlfn.IFNA(VLOOKUP($A107,Indywidualna[],COLUMNS($F106:M106)+7,0),0)","v":0},{"$f":"_xlfn.IFNA(VLOOKUP($A107,Indywidualna[],COLUMNS($F106:N106)+7,0),0)","v":0}]
[null,{"$f":"_xlfn.IFNA(VLOOKUP(A108,Indywidualna[],2,0),0)","v":0},{"$f":"I108+L108","v":0},{"$f":"J108+M108","v":0},{"$f":"K108+N108","v":0},{"$f":"_xlfn.IFNA(VLOOKUP($A108,Indywidualna[],COLUMNS($F107:F107)+7,0),0)","v":0},{"$f":"_xlfn.IFNA(VLOOKUP($A108,Indywidualna[],COLUMNS($F107:G107)+7,0),0)","v":0},{"$f":"_xlfn.IFNA(VLOOKUP($A108,Indywidualna[],COLUMNS($F107:H107)+7,0),0)","v":0},{"$f":"_xlfn.IFNA(VLOOKUP($A108,Indywidualna[],COLUMNS($F107:I107)+7,0),0)","v":0},{"$f":"_xlfn.IFNA(VLOOKUP($A108,Indywidualna[],COLUMNS($F107:J107)+7,0),0)","v":0},{"$f":"_xlfn.IFNA(VLOOKUP($A108,Indywidualna[],COLUMNS($F107:K107)+7,0),0)","v":0},{"$f":"_xlfn.IFNA(VLOOKUP($A108,Indywidualna[],COLUMNS($F107:L107)+7,0),0)","v":0},{"$f":"_xlfn.IFNA(VLOOKUP($A108,Indywidualna[],COLUMNS($F107:M107)+7,0),0)","v":0},{"$f":"_xlfn.IFNA(VLOOKUP($A108,Indywidualna[],COLUMNS($F107:N107)+7,0),0)","v":0}]
[null,{"$f":"_xlfn.IFNA(VLOOKUP(A109,Indywidualna[],2,0),0)","v":0},{"$f":"I109+L109","v":0},{"$f":"J109+M109","v":0},{"$f":"K109+N109","v":0},{"$f":"_xlfn.IFNA(VLOOKUP($A109,Indywidualna[],COLUMNS($F108:F108)+7,0),0)","v":0},{"$f":"_xlfn.IFNA(VLOOKUP($A109,Indywidualna[],COLUMNS($F108:G108)+7,0),0)","v":0},{"$f":"_xlfn.IFNA(VLOOKUP($A109,Indywidualna[],COLUMNS($F108:H108)+7,0),0)","v":0},{"$f":"_xlfn.IFNA(VLOOKUP($A109,Indywidualna[],COLUMNS($F108:I108)+7,0),0)","v":0},{"$f":"_xlfn.IFNA(VLOOKUP($A109,Indywidualna[],COLUMNS($F108:J108)+7,0),0)","v":0},{"$f":"_xlfn.IFNA(VLOOKUP($A109,Indywidualna[],COLUMNS($F108:K108)+7,0),0)","v":0},{"$f":"_xlfn.IFNA(VLOOKUP($A109,Indywidualna[],COLUMNS($F108:L108)+7,0),0)","v":0},{"$f":"_xlfn.IFNA(VLOOKUP($A109,Indywidualna[],COLUMNS($F108:M108)+7,0),0)","v":0},{"$f":"_xlfn.IFNA(VLOOKUP($A109,Indywidualna[],COLUMNS($F108:N108)+7,0),0)","v":0}]
[null,{"$f":"_xlfn.IFNA(VLOOKUP(A110,Indywidualna[],2,0),0)","v":0},{"$f":"I110+L110","v":0},{"$f":"J110+M110","v":0},{"$f":"K110+N110","v":0},{"$f":"_xlfn.IFNA(VLOOKUP($A110,Indywidualna[],COLUMNS($F109:F109)+7,0),0)","v":0},{"$f":"_xlfn.IFNA(VLOOKUP($A110,Indywidualna[],COLUMNS($F109:G109)+7,0),0)","v":0},{"$f":"_xlfn.IFNA(VLOOKUP($A110,Indywidualna[],COLUMNS($F109:H109)+7,0),0)","v":0},{"$f":"_xlfn.IFNA(VLOOKUP($A110,Indywidualna[],COLUMNS($F109:I109)+7,0),0)","v":0},{"$f":"_xlfn.IFNA(VLOOKUP($A110,Indywidualna[],COLUMNS($F109:J109)+7,0),0)","v":0},{"$f":"_xlfn.IFNA(VLOOKUP($A110,Indywidualna[],COLUMNS($F109:K109)+7,0),0)","v":0},{"$f":"_xlfn.IFNA(VLOOKUP($A110,Indywidualna[],COLUMNS($F109:L109)+7,0),0)","v":0},{"$f":"_xlfn.IFNA(VLOOKUP($A110,Indywidualna[],COLUMNS($F109:M109)+7,0),0)","v":0},{"$f":"_xlfn.IFNA(VLOOKUP($A110,Indywidualna[],COLUMNS($F109:N109)+7,0),0)","v":0}]
["Podpis Kapitana",null,{"$f":"SUM(C106:C110)","v":0},{"$f":"SUM(D106:D110)","v":0},{"$f":"SUM(E106:E110)","v":0},{"$f":"SUM(F106:F110)","v":0},{"$f":"SUM(G106:G110)","v":0},{"$f":"SUM(H106:H110)","v":0},{"$f":"SUM(I106:I110)","v":0},{"$f":"SUM(J106:J110)","v":0},{"$f":"SUM(K106:K110)","v":0},{"$f":"SUM(L106:L110)","v":0},{"$f":"SUM(M106:M110)","v":0},{"$f":"SUM(N106:N110)","v":0}]

{"sheet":"tabela_liga","index":3,"n_rows":14,"n_cols":14,"rows_kept":14,"cut":false,"hidden":false,"merged":[[0,0,0,1],[0,2,0,4],[0,5,0,7],[0,8,0,10],[0,11,0,13]]}
["Liga o/ Kaszubsko-Pomorskiego 2018",null,"RAZEM",null,null,"I SERIA",null,null,"II SERIA",null,null,"III SERIA"]
["m-sc","Drużyna","m/p","w","p","m/p2","w2","p2","m/p3","w3","p3","m/p4","w4","p4"]
["1.",{"$f":"liga!A42","v":"FALA Świekatowo"},{"$f":"liga!C48","v":9063},{"$f":"liga!D48","v":97},{"$f":"liga!E48","v":14},{"$f":"liga!I48","v":3397},{"$f":"liga!J48","v":39},{"$f":"liga!K48","v":6},{"$f":"liga!L48","v":2335},{"$f":"liga!M48","v":29},{"$f":"liga!N48","v":7}]
["2.",{"$f":"liga!A60","v":"KS KRAJNA Złotów"},{"$f":"liga!C66","v":9062},{"$f":"liga!D66","v":101},{"$f":"liga!E66","v":21},{"$f":"liga!I66","v":3405},{"$f":"liga!J66","v":37},{"$f":"liga!K66","v":6},{"$f":"liga!L66","v":2218},{"$f":"liga!M66","v":25},{"$f":"liga!N66","v":9}]
["3.",{"$f":"liga!A33","v":"S.K. FAMILY Dziemiany"},{"$f":"liga!C39","v":7889},{"$f":"liga!D39","v":94},{"$f":"liga!E39","v":25},{"$f":"liga!I39","v":2764},{"$f":"liga!J39","v":29},{"$f":"liga!K39","v":5},{"$f":"liga!L39","v":2580},{"$f":"liga!M39","v":36},{"$f":"liga!N39","v":13}]
["4.",{"$f":"liga!A6","v":"MOKSiR Puck"},{"$f":"liga!C12","v":7010},{"$f":"liga!D12","v":78},{"$f":"liga!E12","v":21},{"$f":"liga!I12","v":2343},{"$f":"liga!J12","v":27},{"$f":"liga!K12","v":6},{"$f":"liga!L12","v":2425},{"$f":"liga!M12","v":27},{"$f":"liga!N12","v":8}]
["5.",{"$f":"liga!A51","v":"GOKSiR Liniewo"},{"$f":"liga!C57","v":6923},{"$f":"liga!D57","v":69},{"$f":"liga!E57","v":16},{"$f":"liga!I57","v":2915},{"$f":"liga!J57","v":26},{"$f":"liga!K57","v":5},{"$f":"liga!L57","v":1798},{"$f":"liga!M57","v":18},{"$f":"liga!N57","v":6}]
["6.",{"$f":"liga!A15","v":"MOKSiR Puck II"},{"$f":"liga!C21","v":6853},{"$f":"liga!D21","v":73},{"$f":"liga!E21","v":20},{"$f":"liga!I21","v":2282},{"$f":"liga!J21","v":24},{"$f":"liga!K21","v":7},{"$f":"liga!L21","v":2486},{"$f":"liga!M21","v":26},{"$f":"liga!N21","v":8}]
["7.",{"$f":"liga!A24","v":"KS KRAJNA Złotów II"},{"$f":"liga!C30","v":6543},{"$f":"liga!D30","v":85},{"$f":"liga!E30","v":29},{"$f":"liga!I30","v":1579},{"$f":"liga!J30","v":25},{"$f":"liga!K30","v":11},{"$f":"liga!L30","v":2121},{"$f":"liga!M30","v":26},{"$f":"liga!N30","v":9}]
["8.",{"$f":"liga!A78","v":0},{"$f":"liga!C84","v":0},{"$f":"liga!D84","v":0},{"$f":"liga!E84","v":0},{"$f":"liga!I84","v":0},{"$f":"liga!J84","v":0},{"$f":"liga!K84","v":0},{"$f":"liga!L84","v":0},{"$f":"liga!M84","v":0},{"$f":"liga!N84","v":0}]
["9.",0,{"$f":"liga!C75","v":0},{"$f":"liga!D75","v":0},{"$f":"liga!E75","v":0},{"$f":"liga!I75","v":0},{"$f":"liga!J75","v":0},{"$f":"liga!K75","v":0},{"$f":"liga!L75","v":0},{"$f":"liga!M75","v":0},{"$f":"liga!N75","v":0}]
["10.",{"$f":"liga!A96","v":0},{"$f":"liga!C102","v":0},{"$f":"liga!D102","v":0},{"$f":"liga!E102","v":0},{"$f":"liga!I102","v":0},{"$f":"liga!J102","v":0},{"$f":"liga!K102","v":0},{"$f":"liga!L102","v":0},{"$f":"liga!M102","v":0},{"$f":"liga!N102","v":0}]
["11.",{"$f":"liga!A87","v":0},{"$f":"liga!C93","v":0},{"$f":"liga!D93","v":0},{"$f":"liga!E93","v":0},{"$f":"liga!I93","v":0},{"$f":"liga!J93","v":0},{"$f":"liga!K93","v":0},{"$f":"liga!L93","v":0},{"$f":"liga!M93","v":0},{"$f":"liga!N93","v":0}]
["12.",{"$f":"liga!A105","v":0},{"$f":"liga!C111","v":0},{"$f":"liga!D111","v":0},{"$f":"liga!E111","v":0},{"$f":"liga!I111","v":0},{"$f":"liga!J111","v":0},{"$f":"liga!K111","v":0},{"$f":"liga!L111","v":0},{"$f":"liga!M111","v":0},{"$f":"liga!N111","v":0}]

{"sheet":"zgloszenie","index":4,"n_rows":119,"n_cols":2,"rows_kept":119,"cut":false,"hidden":false,"merged":[[0,0,0,1],[1,0,1,1],[2,0,2,1],[10,0,10,1],[11,0,11,1],[12,0,12,1],[20,0,20,1],[21,0,21,1],[22,0,22,1],[30,0,30,1],[31,0,31,1],[32,0,32,1],[40,0,40,1],[41,0,41,1],[42,0,42,1],[50,0,50,1],[51,0,51,1],[52,0,52,1],[60,0,60,1],[61,0,61,1],[62,0,62,1],[70,0,70,1],[71,0,71,1],[72,0,72,1],[80,0,80,1],[81,0,81,1],[82,0,82,1],[90,0,90,1],[91,0,91,1],[92,0,92,1],[100,0,100,1],[101,0,101,1],[102,0,102,1],[110,0,110,1],[111,0,111,1],[112,0,112,1]]}
["Karta zgłoszenia drużyny"]
["………………………………………………………………………………………………………………….."]
["Drużyna"]
["l.p.","Zawodnik"]
["1.","………………………………………………………………………………………………………"]
["2.","………………………………………………………………………………………………………"]
["3.","………………………………………………………………………………………………………"]
["4.","………………………………………………………………………………………………………"]
["R1.","………………………………………………………………………………………………………"]
[]
["Karta zgłoszenia drużyny"]
["………………………………………………………………………………………………………………….."]
["Drużyna"]
["l.p.","Zawodnik"]
["5.","………………………………………………………………………………………………………"]
["6.","………………………………………………………………………………………………………"]
["7.","………………………………………………………………………………………………………"]
["8.","………………………………………………………………………………………………………"]
["R2.","………………………………………………………………………………………………………"]
[]
["Karta zgłoszenia drużyny"]
["………………………………………………………………………………………………………………….."]
["Drużyna"]
["l.p.","Zawodnik"]
["9.","………………………………………………………………………………………………………"]
["10.","………………………………………………………………………………………………………"]
["11.","………………………………………………………………………………………………………"]
["12.","………………………………………………………………………………………………………"]
["R3.","………………………………………………………………………………………………………"]
[]
["Karta zgłoszenia drużyny"]
["………………………………………………………………………………………………………………….."]
["Drużyna"]
["l.p.","Zawodnik"]
["13.","………………………………………………………………………………………………………"]
["14.","………………………………………………………………………………………………………"]
["15.","………………………………………………………………………………………………………"]
["16.","………………………………………………………………………………………………………"]
["R4.","………………………………………………………………………………………………………"]
[]
["Karta zgłoszenia drużyny"]
["………………………………………………………………………………………………………………….."]
["Drużyna"]
["l.p.","Zawodnik"]
["17.","………………………………………………………………………………………………………"]
["18.","………………………………………………………………………………………………………"]
["19.","………………………………………………………………………………………………………"]
["20.","………………………………………………………………………………………………………"]
["R5.","………………………………………………………………………………………………………"]
[]
["Karta zgłoszenia drużyny"]
["………………………………………………………………………………………………………………….."]
["Drużyna"]
["l.p.","Zawodnik"]
["21.","………………………………………………………………………………………………………"]
["22.","………………………………………………………………………………………………………"]
["23.","………………………………………………………………………………………………………"]
["24.","………………………………………………………………………………………………………"]
["R6.","………………………………………………………………………………………………………"]
[]
["Karta zgłoszenia drużyny"]
["………………………………………………………………………………………………………………….."]
["Drużyna"]
["l.p.","Zawodnik"]
["25.","………………………………………………………………………………………………………"]
["26.","………………………………………………………………………………………………………"]
["27.","………………………………………………………………………………………………………"]
["28.","………………………………………………………………………………………………………"]
["R7.","………………………………………………………………………………………………………"]
[]
["Karta zgłoszenia drużyny"]
["………………………………………………………………………………………………………………….."]
["Drużyna"]
["l.p.","Zawodnik"]
["29.","………………………………………………………………………………………………………"]
["30.","………………………………………………………………………………………………………"]
["31.","………………………………………………………………………………………………………"]
["32.","………………………………………………………………………………………………………"]
["R8.","………………………………………………………………………………………………………"]
[]
["Karta zgłoszenia drużyny"]
["………………………………………………………………………………………………………………….."]
["Drużyna"]
["l.p.","Zawodnik"]
["33.","………………………………………………………………………………………………………"]
["34.","………………………………………………………………………………………………………"]
["35.","………………………………………………………………………………………………………"]
["36.","………………………………………………………………………………………………………"]
["R9.","………………………………………………………………………………………………………"]
[]
["Karta zgłoszenia drużyny"]
["………………………………………………………………………………………………………………….."]
["Drużyna"]
["l.p.","Zawodnik"]
["37.","………………………………………………………………………………………………………"]
["38.","………………………………………………………………………………………………………"]
["39.","………………………………………………………………………………………………………"]
["40.","………………………………………………………………………………………………………"]
["R10.","………………………………………………………………………………………………………"]
[]
["Karta zgłoszenia drużyny"]
["………………………………………………………………………………………………………………….."]
["Drużyna"]
["l.p.","Zawodnik"]
["41.","………………………………………………………………………………………………………"]
["42.","………………………………………………………………………………………………………"]
["43.","………………………………………………………………………………………………………"]
["44.","………………………………………………………………………………………………………"]
["R11.","………………………………………………………………………………………………………"]
[]
["Karta zgłoszenia drużyny"]
["………………………………………………………………………………………………………………….."]
["Drużyna"]
["l.p.","Zawodnik"]
["45.","………………………………………………………………………………………………………"]
["46.","………………………………………………………………………………………………………"]
["47.","………………………………………………………………………………………………………"]
["48.","………………………………………………………………………………………………………"]
["R12.","………………………………………………………………………………………………………"]

{"sheet":"karta_kapitana","index":5,"n_rows":89,"n_cols":14,"rows_kept":89,"cut":false,"hidden":false,"merged":[[0,0,0,13],[1,0,1,1],[1,2,1,4],[1,5,1,7],[1,8,1,10],[1,11,1,13],[2,0,2,1],[8,0,8,1],[10,0,10,13],[11,0,11,1],[11,2,11,4],[11,5,11,7],[11,8,11,10],[11,11,11,13],[12,0,12,1],[18,0,18,1],[20,0,20,13],[21,0,21,1],[21,2,21,4],[21,5,21,7],[21,8,21,10],[21,11,21,13],[22,0,22,1],[28,0,28,1],[30,0,30,13],[31,0,31,1],[31,2,31,4],[31,5,31,7],[31,8,31,10],[31,11,31,13],[32,0,32,1],[38,0,38,1],[40,0,40,13],[41,0,41,1],[41,2,41,4],[41,5,41,7],[41,8,41,10],[41,11,41,13],[42,0,42,1],[48,0,48,1],[50,0,50,13],[51,0,51,1],[51,2,51,4],[51,5,51,7],[51,8,51,10],[51,11,51,13],[52,0,52,1],[58,0,58,1],[60,0,60,13],[61,0,61,1],[61,2,61,4],[61,5,61,7],[61,8,61,10],[61,11,61,13],[62,0,62,1],[68,0,68,1],[70,0,70,13],[71,0,71,1],[71,2,71,4],[71,5,71,7],[71,8,71,10],[71,11,71,13],[72,0,72,1],[78,0,78,1],[80,0,80,13],[81,0,81,1],[81,2,81,4],[81,5,81,7],[81,8,81,10],[81,11,81,13],[82,0,82,1],[88,0,88,1]]}
["KARTA KAPITANA DRUŻYNY"]
["Drużyna",null,"RAZEM",null,null,"I SERIA",null,null,"II SERIA",null,null,"III SERIA"]
[null,null,"m.p","w","p","m.p","w","p","m.p","w","p","m.p","w","p"]
[1]
[2]
[3]
[4]
["R."]
["RAZEM"]
[]
["KARTA KAPITANA DRUŻYNY"]
["Drużyna",null,"RAZEM",null,null,"I SERIA",null,null,"II SERIA",null,null,"III SERIA"]
[null,null,"m.p","w","p","m.p","w","p","m.p","w","p","m.p","w","p"]
[{"$f":"A4+4","v":5}]
[{"$f":"A5+4","v":6}]
[{"$f":"A6+4","v":7}]
[{"$f":"A7+4","v":8}]
["R."]
["RAZEM"]
[]
["KARTA KAPITANA DRUŻYNY"]
["Drużyna",null,"RAZEM",null,null,"I SERIA",null,null,"II SERIA",null,null,"III SERIA"]
[null,null,"m.p","w","p","m.p","w","p","m.p","w","p","m.p","w","p"]
[{"$f":"A14+4","v":9}]
[{"$f":"A15+4","v":10}]
[{"$f":"A16+4","v":11}]
[{"$f":"A17+4","v":12}]
["R."]
["RAZEM"]
[]
["KARTA KAPITANA DRUŻYNY"]
["Drużyna",null,"RAZEM",null,null,"I SERIA",null,null,"II SERIA",null,null,"III SERIA"]
[null,null,"m.p","w","p","m.p","w","p","m.p","w","p","m.p","w","p"]
[{"$f":"A24+4","v":13}]
[{"$f":"A25+4","v":14}]
[{"$f":"A26+4","v":15}]
[{"$f":"A27+4","v":16}]
["R."]
["RAZEM"]
[]
["KARTA KAPITANA DRUŻYNY"]
["Drużyna",null,"RAZEM",null,null,"I SERIA",null,null,"II SERIA",null,null,"III SERIA"]
[null,null,"m.p","w","p","m.p","w","p","m.p","w","p","m.p","w","p"]
[{"$f":"A34+4","v":17}]
[{"$f":"A35+4","v":18}]
[{"$f":"A36+4","v":19}]
[{"$f":"A37+4","v":20}]
["R."]
["RAZEM"]
[]
["KARTA KAPITANA DRUŻYNY"]
["Drużyna",null,"RAZEM",null,null,"I SERIA",null,null,"II SERIA",null,null,"III SERIA"]
[null,null,"m.p","w","p","m.p","w","p","m.p","w","p","m.p","w","p"]
[{"$f":"A44+4","v":21}]
[{"$f":"A45+4","v":22}]
[{"$f":"A46+4","v":23}]
[{"$f":"A47+4","v":24}]
["R."]
["RAZEM"]
[]
["KARTA KAPITANA DRUŻYNY"]
["Drużyna",null,"RAZEM",null,null,"I SERIA",null,null,"II SERIA",null,null,"III SERIA"]
[null,null,"m.p","w","p","m.p","w","p","m.p","w","p","m.p","w","p"]
[{"$f":"A54+4","v":25}]
[{"$f":"A55+4","v":26}]
[{"$f":"A56+4","v":27}]
[{"$f":"A57+4","v":28}]
["R."]
["RAZEM"]
[]
["KARTA KAPITANA DRUŻYNY"]
["Drużyna",null,"RAZEM",null,null,"I SERIA",null,null,"II SERIA",null,null,"III SERIA"]
[null,null,"m.p","w","p","m.p","w","p","m.p","w","p","m.p","w","p"]
[{"$f":"A64+4","v":29}]
[{"$f":"A65+4","v":30}]
[{"$f":"A66+4","v":31}]
[{"$f":"A67+4","v":32}]
["R."]
["RAZEM"]
[]
["KARTA KAPITANA DRUŻYNY"]
["Drużyna",null,"RAZEM",null,null,"I SERIA",null,null,"II SERIA",null,null,"III SERIA"]
[null,null,"m.p","w","p","m.p","w","p","m.p","w","p","m.p","w","p"]
[{"$f":"A74+4","v":33}]
[{"$f":"A75+4","v":34}]
[{"$f":"A76+4","v":35}]
[{"$f":"A77+4","v":36}]
["R."]
["RAZEM"]

{"sheet":"3_27","index":6,"n_rows":38,"n_cols":24,"rows_kept":38,"cut":false,"hidden":false,"merged":[[0,0,0,15],[0,16,0,19],[0,20,0,23],[1,0,4,0],[1,1,4,1],[1,2,4,2],[1,3,4,3],[1,4,4,4],[1,5,4,5],[1,6,1,11],[1,12,3,13],[1,14,1,16],[1,17,1,19],[1,20,1,22],[1,23,4,23],[2,6,4,6],[2,7,4,7],[2,8,4,8],[2,9,4,9],[2,10,4,10],[2,11,4,11],[2,14,2,16],[2,17,2,19],[2,20,2,22],[3,14,3,16],[3,17,3,19],[3,20,3,22],[32,0,32,11],[33,0,33,13],[34,0,34,13],[35,0,35,13],[35,14,35,16],[35,17,35,19],[35,20,35,22],[36,0,36,13],[36,14,36,16],[36,17,36,19],[36,20,36,22],[37,0,37,13],[37,14,37,16],[37,17,37,19],[37,20,37,22]]}
[null,null,null,null,null,null,null,null,null,null,null,null,null,null,null,null," SERIA: ",null,null,null," NR STOL:"]
["  Numer gry","  Wysokość licytacji","  Gra zawodnik","  9, 10, 11, 12, 23, 24                    Podstawa gry","  Ze szczytami","  Bez szczytów","      Podwyższenie       wyniku",null,null,null,null,null,"Wartość gry",null,"Klub:",null,null,"Klub:",null,null,"Klub:",null,null,"Ramsze"]
[null,null,null,null,null,null,"  Z ręki","  Sznajder","  Sznajder zapowiedziany","  Sznajder szwarc","  Sznajder szwarc zapow.","  Overt",null,null,"Zawodnik:",null,null,"Zawodnik:",null,null,"Zawodnik:"]
[null,null,null,null,null,null,null,null,null,null,null,null,null,null,"Nr. Start.:",null,null,"Nr. Start.:",null,null,"Nr. Start.:"]
[null,null,null,null,null,null,null,null,null,null,null,null,"+","-","A","  Wygr.","  Przegr.","B","  Wygr.","  Przegr.","C","  Wygr.","  Przegr."]
["1."]
["2."]
["3."]
["4."]
["5."]
["6."]
["7."]
["8."]
["9."]
["10."]
["11."]
["12."]
["13."]
["14."]
["15."]
["16."]
["17."]
["18."]
["19."]
["20."]
["21."]
["22."]
["23."]
["24."]
["25."]
["26."]
["27."]
[" Punkty z gry"]
["+ (wygrane – przegrane)"]
["+ przegrane gry przeciwników"]
["PUNKTY RAZEM"]
["Dopłaty …………….. zł",null,null,null,null,null,null,null,null,null,null,null,null,null,"zł",null,null,"zł",null,null,"zł"]
["Podpisy"]

{"sheet":"4_36","index":7,"n_rows":47,"n_cols":27,"rows_kept":47,"cut":false,"hidden":false,"merged":[[0,0,0,17],[0,18,0,22],[0,23,0,26],[1,0,4,0],[1,1,4,1],[1,2,4,2],[1,3,4,3],[1,4,4,4],[1,5,4,5],[1,6,1,11],[1,12,3,13],[1,14,1,16],[1,17,1,19],[1,20,1,22],[1,23,1,25],[1,26,4,26],[2,6,4,6],[2,7,4,7],[2,8,4,8],[2,9,4,9],[2,10,4,10],[2,11,4,11],[2,14,2,16],[2,17,2,19],[2,20,2,22],[2,23,2,25],[3,14,3,16],[3,17,3,19],[3,20,3,22],[3,23,3,25],[41,0,41,11],[42,0,42,13],[43,0,43,13],[44,0,44,13],[44,14,44,16],[44,17,44,19],[44,20,44,22],[44,23,44,25],[45,0,45,13],[45,14,45,16],[45,17,45,19],[45,20,45,22],[45,23,45,25],[46,0,46,13],[46,14,46,16],[46,17,46,19],[46,20,46,22],[46,23,46,25]]}
[null,null,null,null,null,null,null,null,null,null,null,null,null,null,null,null,null,null," SERIA: ",null,null,null,null," NR STOL:"]
["  Numer gry","  Wysokość licytacji","  Gra zawodnik","  9, 10, 11, 12, 23, 24                    Podstawa gry","  Ze szczytami","  Bez szczytów","      Podwyższenie       wyniku",null,null,null,null,null,"Wartość gry",null,"Klub:",null,null,"Klub:",null,null,"Klub:",null,null,"Klub:",null,null,"Ramsze"]
[null,null,null,null,null,null,"  Z ręki","  Sznajder","  Sznajder zapowiedziany","  Sznajder szwarc","  Sznajder szwarc zapow.","  Overt",null,null,"Zawodnik:",null,null,"Zawodnik:",null,null,"Zawodnik:",null,null,"Zawodnik:"]
[null,null,null,null,null,null,null,null,null,null,null,null,null,null,"Nr. Start.:",null,null,"Nr. Start.:",null,null,"Nr. Start.:",null,null,"Nr. Start.:"]
[null,null,null,null,null,null,null,null,null,null,null,null,"+","-","A","  Wygr.","  Przegr.","B","  Wygr.","  Przegr.","C","  Wygr.","  Przegr.","D","  Wygr.","  Przegr."]
["1."]
["2."]
["3."]
["4."]
["5."]
["6."]
["7."]
["8."]
["9."]
["10."]
["11."]
["12."]
["13."]
["14."]
["15."]
["16."]
["17."]
["18."]
["19."]
["20."]
["21."]
["22."]
["23."]
["24."]
["25."]
["26."]
["27."]
["28."]
["29."]
["30."]
["31."]
["32."]
["33."]
["34."]
["35."]
["36."]
[" Punkty z gry"]
["+ (wygrane – przegrane)"]
["+ przegrane gry przeciwników"]
["PUNKTY RAZEM"]
["Dopłaty …………….. zł",null,null,null,null,null,null,null,null,null,null,null,null,null,"zł",null,null,"zł",null,null,"zł",null,null,"zł"]
["Podpisy"]